program: Gaussian 09
title: 000051531
version: EM64L-G09RevD.01
frameworkgroup: C1[X(C18H14O)]
method: RPBEPBE
basis: SDD
operation: Freq
keyword: #pfreq=noraman
keyword: PBEPBE/SDD
title: #p freq=noraman PBEPBE/SDD
converged: YES YES NO NO
title: Mulliken charges:
elementType: O C C C C C C C C C C C C C C C C C C H H H H H H H H H H H H H H
charge: -0.245931 -0.093757 -0.305285 -0.463920 0.310816 -0.522743 0.063340 0.251614 -0.508451 0.274981 -0.410342 -0.428769 0.159299 0.443760 -0.507223 -0.350906 -0.440313 -0.259525 -0.250822 0.230279 0.237419 0.229206 0.228164 0.232006 0.242807 0.254960 0.226087 0.244843 0.234421 0.221819 0.242814 0.228630 0.230724
chargesum: 0.00000
title: Mulliken charges with hydrogens summed into heavy atoms:
elementType: O C C C C C C C C C C C C C C C C C C
charge: -0.245931 0.136522 -0.067866 -0.006551 0.310816 -0.047929 0.063340 0.251614 -0.253491 0.274981 -0.184255 -0.183926 0.159299 0.443760 -0.272802 -0.129088 -0.197499 -0.030895 -0.020098
polarizability: 3.30154734e+02 1.61450105e+00 2.00947938e+02 4.57636002e+00 1.64123441e+00 9.11964089e+01
1716.lowfreq: -10.4531 -4.0842 -0.0006 -0.0005 -0.0001 4.5399 46.9198 71.8041 111.5903
frequency: 46.9104 71.7798 111.5852 125.8479 158.8577 192.4262 232.5566 258.0414 272.3455 303.3136 384.5752 401.0468 411.1127 427.3916 457.2079 468.3621 494.7319 503.4287 528.0189 551.0553 564.1879 579.0561 628.3050 660.0602 690.9970 721.3516 757.7034 759.0878 783.3922 790.1426 802.9273 807.9758 830.0288 847.2705 859.0738 860.0646 888.0474 924.2262 937.3273 954.1768 966.4054 980.6942 982.4209 993.0785 1028.2677 1032.4957 1051.0546 1070.0440 1102.5906 1126.7014 1159.7410 1171.7285 1173.3325 1180.5920 1197.4880 1234.8973 1242.7027 1246.7537 1266.9630 1269.2631 1289.5393 1295.4393 1318.5403 1341.7176 1362.1116 1371.9808 1403.7609 1410.1261 1417.8237 1429.2530 1449.7820 1459.4256 1482.3331 1498.4760 1540.0115 1573.1164 1589.3263 1616.2542 1627.8436 2980.2911 3014.8015 3029.8905 3058.1220 3069.1410 3093.0349 3122.8801 3125.5832 3134.0172 3142.8173 3152.1951 3164.3296 3167.0707 3170.7783
redmass: 4.8338 4.2876 2.6272 4.0841 5.0763 3.0464 3.7561 5.1700 5.4433 5.9361 2.8220 3.1933 4.6684 5.1810 4.1893 3.0660 5.4770 5.0454 4.0417 6.4549 3.0078 4.5440 3.9395 5.5388 4.2716 3.3090 1.3213 3.1743 4.6007 2.8706 2.8973 2.2545 2.5070 1.7856 2.5280 3.5769 1.8997 4.5359 1.7879 1.3972 1.3581 2.0711 1.8500 1.3641 2.2720 2.8959 2.8507 1.6085 1.3498 2.0649 1.4350 1.3573 1.2456 1.1511 1.2305 2.0189 1.8931 1.9668 1.6394 1.3921 1.5475 1.7610 1.7706 1.2949 3.3736 3.0816 3.6977 2.8239 2.4887 2.6512 1.8661 1.4001 1.1128 3.1465 4.8290 6.1761 7.1962 6.2720 6.6847 1.0595 1.0599 1.1020 1.0869 1.0920 1.1006 1.0869 1.0880 1.0884 1.0885 1.0938 1.0996 1.0942 1.0954
irintensity: 0.2023 1.1592 1.6646 2.6433 0.6678 0.1248 5.6456 4.4728 1.5279 4.3922 2.6734 5.8511 1.4401 7.1740 2.7011 5.2600 0.2293 1.9975 1.4785 0.5137 2.6177 0.0358 0.7388 0.6113 8.2560 7.2231 37.2354 25.3519 33.7260 31.2364 4.0012 20.7447 69.4809 18.3400 5.5586 1.6620 8.6841 0.2936 7.8624 1.8301 1.6549 10.7707 7.5756 0.5534 8.0276 3.5275 2.5744 18.1824 1.4687 1.5958 2.1289 1.4415 0.4137 1.0075 4.9828 4.1320 7.4006 4.1787 3.3938 5.9762 2.6286 2.4267 1.6379 22.6517 1.1243 3.4628 8.6049 16.7947 3.7771 16.0438 0.9539 15.9298 5.2121 10.8795 0.4158 1.3703 1.0430 2.9399 1.8446 12.3444 64.7139 6.7902 9.6114 10.9899 48.2451 0.7815 9.3138 7.8562 9.4423 16.2441 19.8394 23.8066 31.0220
temp: 298.150 k
press: 1.00000 atm
elementType: 8 6 6 6 6 6 6 6 6 6 6 6 6 6 6 6 6 6 6 1 1 1 1 1 1 1 1 1 1 1 1 1 1
symmnumber: 1
zpe: 690395.0 jmol-1
zpe.correction: 0.262958 hartree
zpe.thermalcorrener: 0.276869 hartree
zpe.thermalcorrenthalpy: 0.277813 hartree
zpe.thermalcorrgfe: 0.222488 hartree
zpe.sumelectzpe: -768.168752 hartree
zpe.sumelectthermal: -768.154841 hartree
zpe.sumelectthermalent: -768.153897 hartree
zpe.sumelectthermalfe: -768.209222 hartree
dipole: 2.5462 2.3450 -0.6276
dipole: 3.5180
quadrupole: -115.3832 -98.1709 -114.2877
quadrupole: -11.9682 4.1280 1.2121
quadrupole: -6.1026 11.1097 -5.0071 -11.9682 4.1280 1.2121
hfenergy: -768.4317099 hartree
pointgroup: C01 [X(C18H14O1)]
dipole: 1.0172802 -0.9048354 0.2491545 debye
polarizability: 330.1642539|0.5323806|200.939616|-4.8164204|1.1834184|91.1952115 unknown
InChI: InChI=1S/C18H14O/c1-2-4-12-11(3-1)5-6-14-13(12)7-8-16-15(14)9-10-17-18(16)19-17/h1-8,17-18H,9-10H2
charge 0 multiplicity 1
33 atoms
O  -4.92156 1.109724 -0.373141
C  -4.162904 -0.19739 -0.594552
C  -3.629972 0.777173 0.388574
C  -4.091373 -1.588498 -0.003587
C  -2.150052 0.886847 0.185226
C  -2.497186 -1.726824 0.135472
C  -1.605901 -0.434628 0.139754
C  -0.172259 -0.579921 0.094681
C  -1.318015 2.030805 0.157873
C  0.678373 0.593034 0.053605
C  0.071458 1.884243 0.077774
C  0.452386 -1.889078 0.0825
C  2.136617 0.432317 -0.010288
C  2.702497 -0.8933 -0.023825
C  1.824135 -2.037679 0.026958
C  3.039187 1.54031 -0.061194
C  4.119676 -1.066854 -0.084853
C  4.426853 1.351334 -0.121491
C  4.977244 0.037581 -0.133364
H  -3.706308 -0.143738 -1.593918
H  -3.910555 0.598952 1.437889
H  -4.483771 -2.396076 -0.646419
H  -4.581106 -1.652555 0.983021
H  -2.145907 -2.357398 -0.70366
H  -2.285436 -2.302068 1.057977
H  -1.774845 3.024896 0.189642
H  0.692258 2.783572 0.045154
H  -0.176322 -2.782465 0.125936
H  2.272168 -3.038592 0.022479
H  2.653746 2.56396 -0.055472
H  4.52571 -2.085343 -0.093203
H  5.092768 2.220391 -0.160228
H  6.062494 -0.10213 -0.180422
