program: Gaussian 09
title: 000051536
version: EM64L-G09RevD.01
frameworkgroup: C1[X(C16H24N2O2)]
method: RPBEPBE
basis: SDD
operation: Freq
keyword: #p
keyword: freq=noraman
keyword: PBEPBE/SDD
title: #p freq=noraman PBEPBE/SDD
converged: YES YES NO NO
title: Mulliken charges:
elementType: O O N N C C C C C C C C C C C C C C C C H H H H H H H H H H H H H H H H H H H H H H H H
charge: -0.264943 -0.250015 -0.089800 -0.064776 -0.351541 -0.361061 -0.381097 -0.373679 -0.353004 -0.614003 -0.280490 -0.179775 -0.574349 0.276306 -0.196259 -0.216067 -0.191168 -0.174287 -0.241038 -0.244927 0.192872 0.199794 0.205840 0.188179 0.188554 0.206426 0.205584 0.186832 0.197721 0.217865 0.222387 0.187938 0.222236 0.236543 0.230975 0.242838 0.250982 0.277347 0.225267 0.213115 0.205827 0.204430 0.208416 0.208007
chargesum: 0.00000
title: Mulliken charges with hydrogens summed into heavy atoms:
elementType: O O N N C C C C C C C C C C C C C C C C
charge: -0.264943 -0.250015 -0.089800 -0.064776 0.041125 0.032958 0.013884 0.018736 0.062582 0.018557 0.187028 0.063063 -0.046021 0.276306 0.029008 -0.002951 0.014659 0.030142 -0.032622 -0.036920
polarizability: 2.26336505e+02 -3.79571352e+00 1.71084735e+02 -1.76786262e+01 -3.29709465e+00 1.72376333e+02
1716.lowfreq: -17.4161 -15.3398 -4.4213 -0.0009 -0.0004 0.0005 5.0427 18.3350 27.0860
frequency: -15.1185 17.3969 26.8124 33.4384 47.6687 71.7181 87.3501 107.2622 144.7267 165.5273 171.1000 194.4970 219.5868 242.5229 247.6239 266.6329 276.8284 316.4522 336.7724 343.2039 376.6806 381.8991 393.2694 417.4367 439.5996 471.5711 491.1155 505.8168 553.2108 609.2769 621.9288 680.3635 699.6823 749.0107 754.6411 772.3572 780.7522 796.5487 805.0510 836.0149 847.4364 866.5498 896.2236 918.3526 924.8211 937.6513 945.2385 960.9629 963.3140 979.8592 986.8676 1009.2696 1021.7694 1045.5886 1052.3483 1073.8879 1079.8588 1092.1068 1093.8971 1096.1020 1122.6017 1125.6666 1146.4305 1147.9444 1151.8268 1178.5593 1187.1460 1193.5978 1218.4136 1226.3295 1238.2732 1240.0081 1271.4321 1277.4178 1280.7149 1292.1176 1305.9048 1315.1533 1330.7457 1336.5769 1348.7747 1355.8058 1357.2163 1370.6643 1372.9283 1397.0393 1397.7665 1429.5290 1432.2286 1440.5371 1451.8622 1452.3960 1458.8569 1462.5757 1470.1940 1473.2459 1480.5003 1482.2722 1559.8075 1614.8524 1624.3084 1635.0652 2847.4967 2848.4836 2863.3487 2867.4050 2875.4686 2891.8479 2991.5196 3017.6287 3018.6373 3024.6110 3028.3016 3031.1128 3032.1333 3040.5779 3042.4108 3075.7321 3082.6252 3083.1908 3088.3463 3091.3189 3099.3732 3116.0335 3124.9718 3135.1004
redmass: 3.3023 4.2963 4.0078 4.9777 5.7480 3.2926 4.1651 2.9811 3.4532 3.7132 4.0776 3.1321 1.1718 3.7148 2.2317 2.4318 2.5895 2.1869 2.7409 2.6386 3.2073 2.6512 3.0231 2.8198 4.5902 3.4608 2.7477 3.7690 3.0314 2.2185 3.1978 4.0812 1.4519 4.0218 1.4107 2.4981 2.1956 1.3087 3.4456 1.9952 1.5444 5.3386 4.7701 2.2429 2.8464 2.2392 3.6968 1.7774 1.3472 1.9700 1.4057 2.3807 2.6076 1.6454 1.7170 1.8875 2.7898 2.0043 2.0349 1.8596 1.8454 2.2580 2.2356 2.3991 2.8503 1.2527 1.3328 1.0731 1.2009 1.0616 1.0926 1.8580 1.3596 1.4449 1.5483 1.3794 1.3180 1.3515 1.5022 1.2799 1.3723 1.4265 1.3602 1.4576 1.4441 1.4878 1.5027 1.1711 1.1714 1.6260 1.0789 1.0795 1.0747 1.0828 1.0833 1.1022 1.0533 1.0866 8.9364 4.7787 6.9608 9.5716 1.0708 1.0622 1.0654 1.0699 1.0676 1.0692 1.0665 1.0726 1.0586 1.0886 1.0912 1.0845 1.0885 1.0887 1.0885 1.1010 1.0876 1.0874 1.0844 1.1083 1.0869 1.0951 1.0960 1.0974
irintensity: 0.0146 0.1801 0.0588 0.3727 1.4294 0.3432 1.1413 0.3052 1.6722 4.3557 0.3019 4.0193 0.1373 5.4242 0.5633 3.7011 2.6733 11.4663 5.9829 12.1755 3.3296 2.4315 7.0185 5.2593 0.6829 0.7939 0.1847 6.4651 4.8293 0.3978 1.5475 11.4887 137.4136 2.0608 23.3115 15.3974 12.4011 3.6673 0.3368 3.1542 0.0725 6.3715 1.7742 3.9416 19.0094 9.5576 51.1607 22.0615 3.3537 10.0093 1.1643 57.1644 1.5356 3.4165 2.3131 4.2025 2.9722 23.5967 3.3096 24.8870 177.7104 189.2811 19.6754 0.5795 63.6341 47.5504 22.2232 0.1704 0.6415 2.4550 2.4935 2.8881 3.6848 90.3208 15.4142 30.2105 0.3601 8.8500 3.8033 1.1235 18.0022 17.5804 3.1167 12.8145 2.5483 6.1763 3.6445 1.2098 23.3713 3.1852 0.1872 0.6047 32.2622 7.4920 8.1365 12.4850 9.4450 10.6234 0.6925 4.6595 6.4740 150.9395 81.9766 43.8563 78.6156 12.7179 192.5410 167.5355 14.4279 49.0117 16.5701 35.8976 62.8610 11.3727 35.3990 32.0312 27.7320 34.6889 4.0784 3.1202 1.8200 32.5088 7.2888 59.7037 49.1748 15.5182
temp: 298.150 k
press: 1.00000 atm
elementType: 8 8 7 7 6 6 6 6 6 6 6 6 6 6 6 6 6 6 6 6 1 1 1 1 1 1 1 1 1 1 1 1 1 1 1 1 1 1 1 1 1 1 1 1
symmnumber: 1
zpe: 982244.3 jmol-1
zpe.correction: 0.374117 hartree
zpe.thermalcorrener: 0.393531 hartree
zpe.thermalcorrenthalpy: 0.394475 hartree
zpe.thermalcorrgfe: 0.324131 hartree
zpe.sumelectzpe: -882.430868 hartree
zpe.sumelectthermal: -882.411455 hartree
zpe.sumelectthermalent: -882.410511 hartree
zpe.sumelectthermalfe: -882.480855 hartree
dipole: -0.7106 0.6181 -1.2895
dipole: 1.5968
quadrupole: -108.0394 -119.9271 -118.7382
quadrupole: 1.5687 -5.4920 4.8123
quadrupole: 7.5289 -4.3589 -3.1700 1.5687 -5.4920 4.8123
hfenergy: -882.8049854 hartree
pointgroup: C01 [X(C16H24N2O2)]
dipole: 0.2745457 -0.1587545 -0.5422999 debye
polarizability: 226.1258933|-7.9565751|170.3269417|16.6614251|2.551387|173.3447373 unknown
InChI: InChI=1S/C16H24N2O2/c1-17-8-10-18(11-9-17)12-13-20-16(19)14-15-6-4-2-3-5-7-15/h2-7,15H,8-14H2,1H3
charge 0 multiplicity 1
44 atoms
O  -0.358747 0.679338 -0.407263
O  -1.227645 1.348203 1.647031
N  3.355626 0.182782 -0.406346
N  6.084823 -0.712535 -0.006403
C  3.673363 -0.93252 0.52278
C  4.34954 0.227303 -1.508318
C  5.091535 -0.766521 1.091509
C  5.768103 0.394647 -0.939416
C  1.954836 0.160943 -0.88744
C  7.471815 -0.65124 0.491166
C  1.014553 0.74119 0.17575
C  -3.93542 0.904772 0.697431
C  -2.736842 0.98958 -0.286546
C  -1.407208 1.027889 0.448532
C  -3.997621 -0.427281 1.436043
C  -5.2736 1.12196 0.004078
C  -4.202445 -1.648393 0.83275
C  -5.80117 0.297297 -0.964297
C  -4.606972 -1.893184 -0.541729
C  -5.322498 -1.019986 -1.349915
H  3.606661 -1.921191 0.00221
H  2.948494 -0.935627 1.356669
H  4.114092 1.086462 -2.16358
H  4.320875 -0.703789 -2.12848
H  5.120243 0.160468 1.720251
H  5.33005 -1.629061 1.742037
H  6.500665 0.381262 -1.76848
H  5.835271 1.391697 -0.432448
H  1.610179 -0.863987 -1.168369
H  1.882984 0.786966 -1.795523
H  7.676706 -1.528848 1.130634
H  7.688496 0.270456 1.089688
H  8.174793 -0.67821 -0.360918
H  1.267762 1.791285 0.40232
H  1.022149 0.168703 1.119925
H  -3.789467 1.701485 1.448022
H  -2.818686 1.918257 -0.887133
H  -2.737492 0.152485 -1.003303
H  -3.818652 -0.399429 2.518571
H  -5.836795 2.023299 0.283269
H  -4.078889 -2.543881 1.459273
H  -6.708304 0.644169 -1.480787
H  -4.440741 -2.909779 -0.924765
H  -5.67502 -1.404235 -2.317283
