program: Gaussian 09
title: 000051463
version: EM64L-G09RevD.01
frameworkgroup: C1[X(C12H4Cl4O)]
method: RPBEPBE
basis: SDD
operation: Freq
keyword: #p
keyword: freq=noraman
keyword: PBEPBE/SDD
title: #p freq=noraman PBEPBE/SDD
converged: NO YES NO NO
title: Mulliken charges:
elementType: Cl Cl Cl Cl O C C C C C C C C C C C C H H H H
charge: 0.020068 0.016316 -0.003156 0.001789 -0.218567 0.406042 0.239848 0.362117 0.321563 -0.335136 -0.389801 -0.340113 -0.308017 -0.126328 -0.237295 -0.223289 -0.233937 0.268699 0.283646 0.237665 0.257888
chargesum: 0.00000
title: Mulliken charges with hydrogens summed into heavy atoms:
elementType: Cl Cl Cl Cl O C C C C C C C C C C C C
charge: 0.020068 0.016316 -0.003156 0.001789 -0.218567 0.406042 0.239848 0.362117 0.321563 -0.335136 -0.121103 -0.340113 -0.308017 -0.126328 0.046351 0.014376 0.023950
polarizability: 2.58549404e+02 4.48481594e+00 2.13957161e+02 -1.62606479e-03 1.20516091e-03 6.03851644e+01
1716.lowfreq: -2.5067 -0.0039 -0.0035 -0.0025 2.5865 6.1040 49.8509 65.2635 91.0408
frequency: 49.8504 65.2576 91.0398 100.2869 158.0326 164.2741 175.1702 190.9348 197.6377 284.1118 293.5463 300.6928 326.7678 358.8191 376.8231 396.2430 502.9723 503.5381 513.4299 535.6879 574.5970 604.2735 605.4380 631.6061 691.5892 720.1522 747.4219 747.6486 791.0782 821.9170 848.0405 874.2925 901.7091 905.3966 974.0915 1039.4739 1051.8277 1126.1582 1158.0041 1176.4615 1210.1773 1221.3074 1251.4203 1333.5674 1378.5774 1400.4280 1408.6622 1440.9277 1464.6894 1558.9554 1586.3338 1596.4828 1632.8195 3152.1217 3172.8588 3182.7658 3190.2713
redmass: 20.4449 10.9701 11.7920 20.4087 9.0779 17.7882 23.1548 5.2917 24.1889 7.4283 15.0896 5.8241 17.9008 9.1647 10.8013 14.8423 7.7990 4.9968 9.5894 4.2533 4.4544 9.9708 8.3194 7.6461 9.1833 5.1329 12.5001 3.1203 1.7958 6.9966 1.4147 9.7425 1.3801 10.2329 1.3301 9.9216 2.2156 3.3233 1.7560 1.8364 2.5952 1.8949 3.7538 5.4986 3.6423 4.4335 7.6132 4.5819 3.2739 8.6907 7.8267 10.2653 10.1043 1.0877 1.0942 1.0927 1.0971
irintensity: 0.0650 0.8944 0.5366 0.4848 1.3659 0.4188 0.2166 0.0320 0.2070 0.6779 0.4283 0.0255 0.9270 0.6417 0.5961 1.8429 8.7756 4.9917 14.1242 1.8951 2.3148 0.0183 15.2669 0.5705 31.5018 20.8596 45.0588 17.7464 44.2833 24.6027 20.8331 45.6495 0.3599 2.1042 0.9816 141.7770 28.4420 72.6310 0.3379 3.1648 73.8085 1.3865 26.5688 58.3271 33.3211 11.2003 48.0665 48.2774 34.6513 3.1821 42.8749 1.2891 8.9514 6.2797 2.2423 3.9287 4.6345
temp: 298.150 k
press: 1.00000 atm
elementType: 17 17 17 17 8 6 6 6 6 6 6 6 6 6 6 6 6 1 1 1 1
symmnumber: 1
zpe: 321548.2 jmol-1
zpe.correction: 0.122471 hartree
zpe.thermalcorrener: 0.136641 hartree
zpe.thermalcorrenthalpy: 0.137585 hartree
zpe.thermalcorrgfe: 0.079962 hartree
zpe.sumelectzpe: -2373.976598 hartree
zpe.sumelectthermal: -2373.962429 hartree
zpe.sumelectthermalent: -2373.961484 hartree
zpe.sumelectthermalfe: -2374.019108 hartree
dipole: -0.5205 -2.1372 0.0002
dipole: 2.1996
quadrupole: -122.3773 -118.4290 -126.6329
quadrupole: 12.8557 0.0003 -0.0001
quadrupole: 0.1024 4.0507 -4.1532 12.8557 0.0003 -0.0001
hfenergy: -2374.0990695 hartree
pointgroup: C01 [X(C12H4Cl4O1)]
dipole: 0.3853197 0.7748873 0.0000968 debye
dipolederiv: -0.0605806 -0.0291916 -0.0000018 0.1117206 -0.6524719 0.0000267 -0.0000067 -0.0000218 -0.0071931 -0.081636 -0.0227834 0.0000044 -0.0906783 -0.7310151 0.0000236 0.0000149 0.0000597 -0.0070199 -0.3013836 0.2537386 -0.0000083 0.3781558 -0.5171305 0.0000106 -0.000018 0.0000229 -0.0209537 -0.6723651 0.2448464 0.0000251 0.2956842 -0.1760199 -0.0000056 0.000062 -0.0000155 -0.0235857 -1.2171428 -0.1087846 -0.0000153 -0.1825427 -0.4195156 -0.000015 -0.0000108 -0.0000157 -0.1196639 0.1712189 -0.121293 0.0000235 0.3216816 -0.2302469 0.0000171 0.0000326 -0.0000156 0.0566817 0.0746351 0.1752788 0.0000092 -0.1520037 -0.0231075 -0.0000014 0.0000212 0.000015 0.0057594 0.7441417 -0.096989 -0.0000035 -0.65127 -0.1930508 0.0000025 -0.0000299 0.0000305 0.1082894 0.3321684 0.3363962 0.0000138 0.7935251 0.1707025 0.0000231 -0.0000075 0.0000185 0.1109981 -0.0750634 0.1231281 0.0000047 -0.0799925 0.9380786 -0.0000485 0.0000103 0.0000264 -0.0713256 0.0365864 -0.090222 -0.0000006 0.1017064 -0.0014695 0.0000091 0.0000009 -0.0000059 -0.1434172 0.1334576 0.088387 -0.000013 0.2321884 1.1930609 -0.0000425 -0.000024 -0.0000952 -0.0987093 0.4205356 -0.5023272 0.0000155 -0.6964606 0.7805152 -0.0000295 0.0000339 -0.0000426 -0.094873 0.946056 -0.3703836 -0.0000558 -0.5714359 0.0412023 0.0000225 -0.0000876 0.0000051 -0.0458733 -0.3627356 0.012497 -0.0000022 0.0916878 -0.2507452 -0.0000065 0.0000185 0.0000084 -0.0599499 -0.090898 0.0713452 0.0000027 0.1258165 0.0793178 0.0000069 -0.0000067 -0.0000002 -0.1556791 -0.1229544 0.0513447 0.0000013 0.0273853 -0.1579178 0.0000126 -0.0000025 0.0000172 -0.1036148 0.0938137 0.0772907 0. 0.0375965 0.0154003 -0.0000047 -0.0000024 0.0000056 0.1675899 0.0581937 -0.0288448 0.0000106 -0.0187544 0.0780831 0.0000065 0.0000109 0.0000121 0.1712013 0.0100704 -0.0712037 -0.0000041 -0.0828578 -0.0505335 -0.0000066 0.0000047 -0.0000067 0.1640066 -0.036118 0.0077703 -0.000006 0.0088476 0.1068636 -0.0000011 -0.0000138 -0.0000023 0.1673321 unknown
polarizability: 258.3077437|-5.5525977|214.198821|0.0013199|-0.0015344|60.3851644 unknown
InChI: InChI=1S/C12H4Cl4O/c13-6-3-1-2-5-9-10(16)7(14)4-8(15)12(9)17-11(5)6/h1-4H
charge 0 multiplicity 1
21 atoms
Cl -1.734361 2.954416 -0.000187
Cl -1.756357 -3.514267 0.000038
Cl 3.862484 -2.09154 0.000056
Cl -4.542458 1.282118 0.000034
O  0.736606 -1.546584 -0.000085
C  -0.518683 0.437061 -0.000104
C  0.899048 0.802829 -0.000015
C  -0.557647 -0.990602 -0.000088
C  1.611463 -0.435108 -0.000047
C  -1.738964 1.148878 -0.00018
C  1.624174 2.018202 0.000056
C  -1.757005 -1.71347 -0.000067
C  3.00994 -0.499268 -0.000004
C  -2.94921 0.423425 -0.000092
C  -2.966438 -0.993618 -0.000009
C  3.033953 1.954642 0.000075
C  3.726933 0.7137 0.000046
H  1.105734 2.979274 0.000071
H  -3.922526 -1.522978 0.000116
H  3.617876 2.880418 0.000103
H  4.820736 0.689971 0.000083
