program: Gaussian 09
title: 000051505
version: EM64L-G09RevD.01
frameworkgroup: C1[X(C19H32N2O2)]
method: RPBEPBE
basis: SDD
operation: Freq
keyword: #p
keyword: freq=noraman
keyword: PBEPBE/SDD
title: #p freq=noraman PBEPBE/SDD
converged: YES YES NO NO
title: Mulliken charges:
elementType: O O N N C C C C C C C C C C C C C C C C C C C H H H H H H H H H H H H H H H H H H H H H H H H H H H H H H H H
charge: -0.306108 -0.275920 -0.357857 -0.685027 0.011080 -0.495175 -0.414418 -0.016378 -0.027347 -0.397710 -0.710356 -0.714811 -0.696859 -0.718952 0.027326 -0.712199 0.173074 0.222341 -0.336727 -0.329895 -0.407491 -0.400660 0.500025 0.180317 0.217628 0.191605 0.193325 0.186065 0.182371 0.211993 0.246349 0.205209 0.232633 0.203042 0.213522 0.221483 0.204877 0.214737 0.214910 0.191344 0.195552 0.247805 0.204457 0.208547 0.211904 0.219029 0.212984 0.243249 0.223211 0.264959 0.266297 0.220588 0.219152 0.310327 0.310570
chargesum: 0.00000
title: Mulliken charges with hydrogens summed into heavy atoms:
elementType: O O N N C C C C C C C C C C C C C C C C C C C
charge: -0.306108 -0.275920 -0.111507 -0.064130 0.191396 -0.085942 -0.035027 0.165993 0.184646 0.040132 -0.072309 -0.080286 -0.062158 -0.094043 0.246355 -0.032755 0.173074 0.222341 -0.071769 -0.063598 -0.186903 -0.181508 0.500025
polarizability: 3.27430283e+02 1.58608363e+00 2.31280334e+02 -3.00508959e+01 3.02025734e+00 1.67869538e+02
1716.lowfreq: -9.7288 -3.7482 0.0003 0.0005 0.0007 4.6238 6.6671 16.9842 20.0474
frequency: 3.2520 15.5074 18.8234 20.2293 34.1665 53.1834 59.8048 70.5452 83.7416 99.0538 110.3750 118.2669 145.3143 181.2637 182.2428 198.6710 206.4847 219.0973 224.8383 230.2195 242.8358 255.1776 270.9041 283.0167 295.7492 312.3205 340.8269 357.5733 365.0702 380.6276 403.1891 403.5956 407.3496 409.0505 412.0086 414.8774 438.2055 443.6359 505.9171 512.5872 535.5784 605.5268 612.2078 633.9050 676.3818 698.5648 754.2273 775.9789 778.4508 813.1202 821.5821 823.7486 834.8385 841.9659 842.7789 867.4304 901.0684 912.0379 915.1766 916.7513 932.2628 946.7120 955.1083 958.3018 973.2440 978.9485 982.7684 997.0268 1016.4045 1024.3100 1048.7489 1056.4367 1063.8813 1096.7226 1103.8600 1122.6047 1129.7667 1141.1516 1153.8009 1163.7605 1172.8447 1179.7588 1180.4616 1193.0378 1225.0003 1248.2745 1251.8551 1253.9825 1272.0680 1295.5398 1307.0142 1308.9166 1318.3890 1324.9366 1331.7717 1333.9966 1340.5210 1350.0090 1356.3827 1367.5496 1373.6001 1377.8459 1380.5752 1386.4120 1391.7576 1394.6955 1397.5780 1447.0961 1447.3947 1451.7807 1456.2247 1462.6460 1463.8291 1467.1322 1471.9180 1472.2324 1473.2922 1477.0161 1482.2513 1484.3967 1487.9743 1491.5062 1516.3923 1569.4549 1605.9998 1631.3620 1645.8061 2844.5856 2903.0700 2939.4270 2955.9810 2960.1633 2962.7294 2964.6176 2966.3300 2969.3017 2971.8226 2993.3254 3006.2938 3009.2308 3026.6381 3037.9758 3047.8068 3058.2603 3058.4596 3063.2532 3065.6734 3069.2924 3074.1840 3090.3108 3091.9330 3106.3678 3122.3644 3125.3910 3158.1526 3173.2385 3411.0787 3560.5732 3700.3950
redmass: 3.5631 3.4468 3.3049 4.1425 2.8656 3.5922 3.7741 4.1841 3.2728 4.2144 4.6530 3.0097 2.7329 2.9247 2.0495 1.1969 1.1192 1.3877 1.2487 1.1501 1.9916 3.4081 3.2754 4.2629 2.2946 2.7321 3.1525 2.2766 3.2609 3.0392 2.3663 2.0805 1.1200 1.2401 2.1076 2.3932 3.2849 2.4937 2.8209 3.0497 3.3382 3.6027 3.8830 6.8924 4.0348 1.5707 4.5036 5.5996 2.7751 2.7209 3.7002 1.2657 2.7845 2.0568 1.8951 1.6833 2.2522 2.1144 1.2171 1.2689 1.3066 1.7355 1.5021 1.4441 1.3627 1.9576 1.3500 3.3097 1.4887 1.9608 3.3036 2.3868 1.7383 2.2087 2.3320 2.0013 1.2153 2.3620 2.0882 2.3066 1.8605 1.1573 1.8371 2.1728 1.3198 1.2861 2.2429 1.4215 1.2112 1.3325 1.3181 1.2946 1.4291 2.7080 1.4504 1.4159 1.4389 1.4659 1.3206 1.4178 1.2137 1.3495 1.2219 1.2871 4.7530 1.2343 1.2147 1.0888 4.1644 1.0807 1.0511 1.2074 1.0501 1.0473 1.0591 1.0622 1.0589 1.0501 1.0571 1.0763 1.0492 1.0550 3.2016 7.3365 9.8448 3.2415 1.4363 1.0806 1.0697 1.0824 1.0572 1.0383 1.0660 1.0422 1.0393 1.0608 1.0429 1.0359 1.0847 1.0994 1.1012 1.0902 1.0990 1.0988 1.0992 1.0992 1.0988 1.0995 1.0985 1.0982 1.0997 1.0993 1.0893 1.0895 1.0952 1.0948 1.0732 1.0450 1.1040
irintensity: 1.1014 0.5260 0.6900 0.6706 0.2566 0.3897 0.5556 1.7370 0.5749 0.7498 0.3301 1.8247 0.6252 0.7790 3.3916 0.0772 0.1778 0.6875 0.0643 0.0514 3.9837 1.2902 1.4353 9.6388 0.3360 0.7710 2.7953 2.4673 4.7224 9.2188 4.6918 4.6401 43.9447 261.1099 0.3129 0.9241 3.1112 7.7527 4.7385 1.6605 4.4131 20.5274 7.2022 1.7996 29.4755 45.4428 13.2403 14.7016 2.4140 4.2824 1.2723 0.4522 2.3719 13.5653 62.1199 10.3766 3.7542 8.5339 5.5083 10.7901 3.7036 3.3931 1.8318 0.4131 0.1696 2.7558 0.1250 43.9713 15.6361 9.8223 466.5883 43.6530 9.7574 12.1120 55.8943 2.3212 14.3971 35.7255 25.6453 40.6256 2.0223 165.1082 23.4038 8.2767 2.9846 4.1951 285.6578 55.3893 9.7327 7.2635 4.7454 2.7346 0.3071 97.8490 26.1071 27.6142 26.1466 7.3798 11.4636 2.0470 17.1829 16.7917 17.9603 5.2252 14.3553 14.1513 22.8631 5.0979 6.2901 5.4781 7.7315 30.0113 19.6943 2.9952 7.5648 22.7858 3.9749 18.9730 4.6443 7.6331 25.5111 17.4537 75.0764 41.3331 331.4324 108.0098 339.0833 68.5982 81.3995 28.4989 31.8199 50.3328 2.8306 63.0185 28.5292 34.3635 39.1095 18.5768 15.1543 35.5848 35.6572 26.0831 19.3214 103.6480 10.1730 56.6363 77.6058 46.6856 64.1530 20.3318 35.1148 18.9207 15.4452 24.3446 9.1634 3.7788 2.7306 115.3874 22.8787
temp: 298.150 k
press: 1.00000 atm
elementType: 8 8 7 7 6 6 6 6 6 6 6 6 6 6 6 6 6 6 6 6 6 6 6 1 1 1 1 1 1 1 1 1 1 1 1 1 1 1 1 1 1 1 1 1 1 1 1 1 1 1 1 1 1 1 1
symmnumber: 1
zpe: 1255752.6 jmol-1
zpe.correction: 0.478291 hartree
zpe.thermalcorrener: 0.505293 hartree
zpe.thermalcorrenthalpy: 0.506237 hartree
zpe.thermalcorrgfe: 0.416062 hartree
zpe.sumelectzpe: -1001.374289 hartree
zpe.sumelectthermal: -1001.347287 hartree
zpe.sumelectthermalent: -1001.346343 hartree
zpe.sumelectthermalfe: -1001.436518 hartree
dipole: 3.7071 -0.7674 -1.8534
dipole: 4.2150
quadrupole: -89.9002 -140.7160 -144.6993
quadrupole: -7.0713 -11.3906 -0.2180
quadrupole: 35.2050 -15.6109 -19.5941 -7.0713 -11.3906 -0.2180
hfenergy: -1001.8525799 hartree
pointgroup: C01 [X(C19H32N2O2)]
dipole: -1.4710616 -0.3481575 0.681733 debye
polarizability: 327.9389308|-0.3243374|231.1965519|-28.6563365|4.1632277|167.444672 unknown
InChI: InChI=1S/C19H32N2O2/c1-13(2)10-18(11-14(3)4)21-12-15(5)23-19(22)16-6-8-17(20)9-7-16/h6-9,13-15,18,21H,10-12,20H2,1-5H3
charge 0 multiplicity 1
55 atoms
O  -1.449153 -0.666414 -0.860005
O  -1.586437 1.669244 -0.800802
N  2.23628 -0.014602 -0.414279
N  -7.576012 -0.159247 0.982044
C  3.213757 0.053467 0.713934
C  4.401269 0.963634 0.310975
C  3.688883 -1.353749 1.186039
C  4.093061 2.484716 0.207541
C  4.716692 -2.124973 0.311729
C  0.85707 -0.384897 -0.025915
C  3.733533 3.105594 1.578936
C  5.298541 3.224803 -0.420397
C  4.129583 -2.595824 -1.040217
C  5.271097 -3.333339 1.106533
C  -0.0171 -0.557763 -1.288273
C  0.288897 -1.822895 -2.086728
C  -2.132429 0.543176 -0.640347
C  -3.533903 0.322285 -0.221287
C  -4.351328 1.454799 0.044978
C  -4.095696 -0.975848 -0.076409
C  -5.686611 1.303317 0.4430
C  -5.431163 -1.139412 0.320449
C  -6.251831 -0.000957 0.587826
H  2.71831 0.515259 1.606609
H  4.79522 0.610165 -0.663389
H  5.216288 0.82796 1.051406
H  2.801684 -2.003419 1.33745
H  4.136463 -1.211119 2.192656
H  3.222318 2.632355 -0.46889
H  5.569892 -1.447587 0.099105
H  2.225195 0.879985 -0.9269
H  0.881718 -1.342683 0.525568
H  0.378956 0.372049 0.639541
H  4.571334 2.979195 2.292455
H  3.534474 4.188868 1.479985
H  2.835208 2.641448 2.024295
H  6.198788 3.111066 0.214601
H  5.09431 4.306596 -0.524715
H  5.53963 2.823879 -1.422733
H  3.307045 -3.319167 -0.871356
H  4.90333 -3.099699 -1.650989
H  3.70968 -1.746714 -1.60437
H  4.454088 -4.03036 1.378447
H  5.766582 -3.012217 2.042573
H  6.008096 -3.899479 0.506267
H  0.071218 0.352148 -1.914231
H  0.05866 -2.72279 -1.488492
H  1.362546 -1.83642 -2.339564
H  -0.304456 -1.859389 -3.016337
H  -3.911262 2.451181 -0.069778
H  -3.469871 -1.848879 -0.281818
H  -6.30433 2.186765 0.645195
H  -5.852656 -2.146436 0.427252
H  -7.982568 -1.084585 1.086359
H  -8.163492 0.64751 1.172973
