program: Gaussian 09
title: 000006943
version: EM64L-G09RevD.01
frameworkgroup: C1[X(C9H12O)]
method: RPBEPBE
basis: SDD
operation: Freq
keyword: #pfreq=noraman
keyword: PBEPBE/SDD
title: #p freq=noraman PBEPBE/SDD
converged: NO YES NO NO
title: Mulliken charges:
elementType: O C C C C C C C C C H H H H H H H H H H H H
charge: -0.445941 -0.221585 0.413345 -0.694397 -0.694370 0.098749 -0.371004 -0.393948 -0.272888 -0.215562 0.259195 0.206083 0.211091 0.228014 0.228020 0.211085 0.206105 0.230373 0.213357 0.224069 0.225522 0.354686
chargesum: 0.00000
title: Mulliken charges with hydrogens summed into heavy atoms:
elementType: O C C C C C C C C C
charge: -0.091254 0.037611 0.413345 -0.049210 -0.049159 0.098749 -0.140631 -0.180591 -0.048819 0.009960
polarizability: 1.23480673e+02 1.07479497e+00 1.06870517e+02 -2.61089638e-03 -5.64391538e-03 6.11276822e+01
1716.lowfreq: -5.8497 -0.0005 0.0003 0.0004 4.3401 10.7712 31.4563 111.5436 188.5282
frequency: 30.8004 111.5430 188.5281 203.2332 216.1921 244.6666 268.6676 336.8625 356.4196 393.7313 476.9777 498.0745 505.5493 562.7679 581.8802 712.1096 743.0884 751.5416 806.4378 841.7365 890.3547 919.8064 929.8488 954.0366 970.2726 1029.6291 1063.4699 1069.7194 1116.1568 1145.2594 1161.0570 1171.2735 1204.9077 1243.1970 1287.1904 1324.2449 1352.3249 1375.3848 1391.0367 1398.2496 1439.0732 1466.2529 1467.2657 1477.4276 1481.9937 1494.9062 1602.4652 1611.7804 2970.7487 2973.8017 3031.9799 3062.2309 3073.5555 3075.8113 3081.3400 3104.1212 3119.2040 3139.2888 3162.6181 3582.4030
redmass: 2.9282 3.3944 2.6070 1.5979 1.6779 1.2132 2.6825 2.6543 1.2145 2.8367 3.0248 4.1566 3.9857 3.5730 4.5406 3.5964 2.9602 1.3761 5.8043 1.4554 2.6016 1.1898 1.3804 1.4406 1.3113 2.2039 2.6028 1.4923 2.7031 1.6206 1.3461 1.0788 1.8442 2.6919 1.6868 1.2889 1.4978 1.1934 1.6047 2.4086 2.2891 1.0501 1.0454 1.0505 1.2543 1.8746 6.3365 6.6547 1.0348 1.0353 1.0861 1.1000 1.0981 1.1004 1.0989 1.0885 1.0878 1.0919 1.1003 1.0659
irintensity: 0.1346 2.3564 1.6476 0.2489 0.5850 0.7259 0.9251 20.7256 114.9304 4.9402 15.1822 9.7605 0.2513 0.2221 1.2048 3.7598 6.6089 91.5914 23.9480 0.0109 5.8481 3.3092 1.0110 0.0266 0.0028 19.7794 78.0752 8.2354 2.8358 98.5625 15.2232 1.3559 11.7119 38.6117 35.1552 0.4849 1.6383 15.4720 1.7834 16.2629 37.1380 6.1068 0.0650 15.3156 0.6452 42.8892 19.1678 4.5071 33.4815 37.0357 1.0493 0.1713 97.4801 26.1442 38.4164 19.0605 7.9945 23.4788 24.5717 26.1483
temp: 298.150 k
press: 1.00000 atm
elementType: 8 6 6 6 6 6 6 6 6 6 1 1 1 1 1 1 1 1 1 1 1 1
symmnumber: 1
zpe: 485962.0 jmol-1
zpe.correction: 0.185093 hartree
zpe.thermalcorrener: 0.195203 hartree
zpe.thermalcorrenthalpy: 0.196147 hartree
zpe.thermalcorrgfe: 0.149632 hartree
zpe.sumelectzpe: -424.624267 hartree
zpe.sumelectthermal: -424.614158 hartree
zpe.sumelectthermalent: -424.613214 hartree
zpe.sumelectthermalfe: -424.659728 hartree
dipole: -1.1295 0.5701 0.0001
dipole: 1.2652
quadrupole: -54.3930 -53.4738 -64.7863
quadrupole: -4.7322 0.0000 -0.0020
quadrupole: 3.1580 4.0773 -7.2353 -4.7322 0.0000 -0.0020
hfenergy: -424.8093606 hartree
pointgroup: C01 [X(C9H12O1)]
dipole: -0.4382278 -0.2360598 -0.0000635 debye
dipolederiv: -0.1674758 0.3653026 0.0000132 0.2969546 -1.2606533 -0.0000216 0.0000342 -0.0000315 -0.4051822 0.1154869 0.0006211 0.0000588 -0.1228075 0.0691227 0.0000271 0.0002892 0.000008 0.1412867 0.2818406 -0.1127425 -0.0001207 0.109979 -0.2725976 -0.0000393 -0.000159 -0.0000516 -0.131123 -0.0281808 -0.0269686 -0.0337415 0.0115766 0.081898 -0.0197259 0.0286341 -0.03679 -0.03339 -0.0282005 -0.0269182 0.0337459 0.0115655 0.0819581 0.0195976 -0.028784 0.0366682 -0.0334727 0.0355999 -0.2785906 -0.0000046 -0.2626316 1.169998 0.0000519 -0.0000521 0.0000638 0.0561274 0.0431529 0.0018841 0.00002 0.0289881 0.104849 0.0000069 -0.0000016 0.0000182 -0.1374889 -0.0735784 0.2861719 -0.0000037 -0.0029019 -0.1441247 0.0000004 0.0000146 -0.0000003 -0.1896424 -0.1668878 -0.018581 0.0000035 -0.0973356 0.0149139 0.0000065 -0.0000055 0.0000072 -0.1954798 0.0772548 -0.0427475 0.0000058 0.1126437 0.0823861 -0.0000066 0.0000016 0.0000153 -0.1529634 0.0664769 0.0129923 -0.0000194 0.0539067 -0.0762676 0.0000834 -0.0000378 0.0000717 0.0299421 0.0936291 0.054092 -0.0084915 0.0093584 -0.1595384 -0.0407008 -0.0066448 0.0287543 0.0661699 -0.2375197 0.0404914 -0.0418321 0.0449638 0.079156 -0.012027 -0.0197882 -0.0158157 0.0765229 0.0761377 -0.0478804 0.0988025 -0.0316022 0.0463669 0.081639 0.0645277 0.0567384 -0.1191301 0.0760658 -0.0480257 -0.0988311 -0.0316944 0.0462174 -0.0818257 -0.0646121 -0.056867 -0.1188686 -0.2375444 0.0405392 0.0419315 0.0449566 0.0791873 0.0120147 0.0199464 0.0158035 0.076458 0.0935898 0.0540874 0.0084476 0.0093932 -0.1594885 0.0409554 0.006621 -0.0285463 0.0661535 -0.0031857 -0.1179318 0.0000044 -0.1151861 -0.0126892 -0.0000085 0.0000251 -0.0000085 0.1334009 0.0032473 -0.0825349 0.0000014 -0.1152589 -0.0934205 -0.0000069 -0.0000014 -0.0000143 0.16866 0.0440533 0.0646775 0.0000052 0.0830748 -0.105712 -0.000011 0.0000003 -0.0000123 0.1679744 -0.1321482 0.039551 0.0000063 0.0317295 0.0822463 -0.0000043 0.0000041 -0.000003 0.1607802 0.0681861 -0.1574893 -0.0000015 -0.0696723 0.346192 -0.0000049 -0.0000118 -0.000008 0.3732649 unknown
polarizability: 123.5261606|-0.6305261|106.8250295|-0.0038477|0.0052317|61.1276822 unknown
InChI: InChI=1S/C9H12O/c1-7(2)8-5-3-4-6-9(8)10/h3-7,10H,1-2H3
charge 0 multiplicity 1
22 atoms
O  -0.113312 -2.320221 -0.000148
C  1.809181 -0.201942 -0.000132
C  0.301147 0.061808 -0.000017
C  2.481833 0.368271 1.277648
C  2.481214 0.366854 -1.278887
C  -0.635303 -1.007879 -0.000068
C  -0.222538 1.378215 0.000025
C  -2.031619 -0.771202 -0.000027
C  -1.611911 1.635302 0.000046
C  -2.520369 0.552584 0.000033
H  1.953443 -1.29669 0.000433
H  2.369282 1.467456 1.333468
H  3.563985 0.138774 1.278392
H  2.03489 -0.065071 2.190457
H  2.033833 -0.067527 -2.190988
H  3.563375 0.137398 -1.279918
H  2.368546 1.465968 -1.335853
H  0.478579 2.221827 0.000036
H  -2.732653 -1.617383 -0.000049
H  -1.981588 2.666126 0.000082
H  -3.600994 0.732718 0.000056
H  -0.846422 -2.984187 -0.00019
