program: Gaussian 09
title: Title
version: EM64L-G09RevE.01
method: UB3LYP
basis: 6-31G(d,p)
operation: Freq
keyword: #N
keyword: Geom=AllCheck
keyword: Guess=TCheck
keyword: SCRF=Check
keyword: GenChk
keyword: UB3LYP/6-31G(d,p)
keyword: Freq
converged: YES YES YES YES
elementType: C
elementType: H
1716.lowfreq: -5.7046 0.0005 0.0005 0.0005 9.6574 15.8186 85.7578 109.1298 203.1294
frequency: 85.7578 109.1298 203.1294 220.6661 233.2880 285.9337 385.1956 389.3202 394.0528 403.3133 455.9274 458.4009 515.0883 550.1842 553.1187 610.5537 634.5223 698.7163 714.6203 718.8636 762.8442 782.9291 792.0973 815.7591 849.6371 868.2579 875.9008 900.4485 905.9346 907.7933 947.2409 988.8656 989.4850 1014.0299 1040.5843 1049.9986 1167.1670 1190.0330 1195.3441 1198.9651 1219.8401 1225.8033 1282.7679 1286.0043 1380.8963 1399.3182 1414.6264 1430.1274 1435.7845 1461.0594 1489.1399 1510.3975 1521.2844 1530.2208 1550.0665 1645.6602 3201.0759 3201.7985 3204.8093 3205.7897 3206.9337 3208.4268 3223.5728 3223.7282 3236.7997 3237.0565
redmass: 4.9557 3.5939 4.8138 3.8998 3.5260 2.9922 4.7278 6.7842 3.1356 2.4020 2.5525 2.2544 6.4988 7.4691 6.5866 6.7516 3.3957 2.9711 1.1693 1.2067 5.7012 4.4795 1.4246 1.3565 1.9388 1.8676 5.2943 1.5192 1.5859 4.7957 2.7723 1.3258 1.3261 2.5930 3.0595 2.0393 1.3323 1.7177 4.6121 1.2362 1.1548 1.7725 1.9555 2.9198 7.0038 1.7542 1.4345 1.6165 2.0351 8.7460 2.8445 3.0714 3.5667 2.8248 3.3640 6.2596 1.0896 1.0895 1.0890 1.0888 1.0902 1.0906 1.0889 1.0891 1.0987 1.0988
irintensity: 1.9061 0.0016 0.1132 0.0000 0.0000 1.4385 0.0000 0.0000 0.0000 14.7313 0.0000 0.0001 0.0000 39.6791 1.8043 0.0000 0.0000 0.0009 85.5502 0.0000 0.0000 3.9372 0.0004 45.1729 0.0002 0.0000 11.9544 0.0000 6.2937 0.0001 1.1059 0.0000 0.0002 0.0001 0.0000 12.4496 30.6082 0.0000 20.8019 0.0249 10.8153 0.0000 0.0001 2.1494 754.6103 45.3824 0.0006 53.0441 0.0002 0.0011 59.5636 0.8643 0.0038 0.0000 64.2781 0.0000 0.0187 0.0000 0.0016 5.2013 4.2301 0.0006 0.0000 0.0642 0.1315 0.0000
temp: 298.150 k
press: 1.00000 atm
elementType: 6 6 6 6 6 6 6 6 6 6 6 1 6 6 6 1 1 1 1 1 1 1 1 1
symmnumber: 1
zpe: 495230.6 jmol-1
zpe.correction: 0.188623 hartree
zpe.thermalcorrener: 0.199044 hartree
zpe.thermalcorrenthalpy: 0.199988 hartree
zpe.thermalcorrgfe: 0.151742 hartree
zpe.sumelectzpe: -538.998607 hartree
zpe.sumelectthermal: -538.988186 hartree
zpe.sumelectthermalent: -538.987242 hartree
zpe.sumelectthermalfe: -539.035488 hartree
dipole: -18.7487 1.3123 -0.0534
dipole: 18.7946
quadrupole: 40.7259 -47.1965 -81.8775
quadrupole: 8.4397 0.3477 -0.0604
quadrupole: 70.1752 -17.7471 -52.4281 8.4397 0.3477 -0.0604
hfenergy: -539.1872303 hartree
pointgroup: C01 [X(C14H10)]
dipole: -0.0000238 0.0000122 0.000038 debye
dipolederiv: -0.4276591 0.08693 -0.0015353 0.3591177 0.1523788 0.0006828 -0.0022989 -0.0003105 -0.0604735 0.7299401 0.034126 0.0025295 0.1011753 0.3820058 -0.0006997 0.0023254 -0.000942 -0.0111019 0.6150201 0.3320571 0.0009876 -0.7527206 -0.6816719 -0.0005852 0.0039547 0.0032714 0.0859541 -0.5564538 -0.1033866 -0.0020049 0.9803934 0.4851809 0.0024049 -0.0049403 -0.0014414 0.0857233 0.522199 0.2168735 0.0013084 0.1491754 0.5892289 -0.001107 0.0014214 -0.0009034 -0.0111023 0.2051172 0.0069274 0.0009071 -0.2649101 -0.4778024 0.0001958 0.0016911 0.0011848 -0.0602726 -0.826289 -0.6143598 -0.0007103 -0.6142393 -0.1426495 -0.0022318 -0.0007031 -0.0022444 -0.1565237 -0.8222265 -0.6119699 -0.0006964 -0.6118541 -0.1412483 -0.002236 -0.0006835 -0.0022292 -0.1564402 0.6114053 0.330349 0.0009741 -0.7532877 -0.6825471 -0.0005842 0.0039764 0.0033139 0.0857064 -0.5539639 -0.1021964 -0.002011 0.9827115 0.487171 0.0024084 -0.0050289 -0.001496 0.085969 0.5222115 0.2170248 0.0013088 0.1502 0.5900377 -0.001101 0.0015284 -0.0008505 -0.0111213 0.0950544 0.0063582 -0.0000931 0.0178824 -0.0040728 0.0003927 -0.000137 0.000358 0.1168817 0.2046111 0.0071319 0.0009325 -0.2654156 -0.4798886 0.0001967 0.0016687 0.0011539 -0.0604636 -0.4258094 0.086693 -0.0015371 0.3581661 0.1531255 0.0007007 -0.002284 -0.0002689 -0.0602829 0.728812 0.0337164 0.0025571 0.1016397 0.3822968 -0.0007185 0.0023708 -0.0009649 -0.011084 0.026726 0.0207492 -0.0004263 0.0206609 0.0037934 0.0004205 -0.0004184 0.000435 0.130088 0.0594486 -0.0323374 -0.000167 -0.0280224 0.0485418 0.0001298 -0.0001621 0.0001244 0.1319534 0.029694 0.0543387 -0.0004565 0.0427741 0.06134 0.0003018 -0.0004165 0.0003672 0.1168607 0.0951243 0.0062912 -0.0000928 0.0179003 -0.0041449 0.0003975 -0.0001183 0.0003511 0.116891 0.0257278 -0.0090622 -0.000348 -0.0135032 0.0825129 0.0000882 -0.0003376 0.0001092 0.1319707 0.0266905 0.0207461 -0.0004285 0.0206572 0.0037619 0.0004231 -0.0004349 0.0004216 0.1300728 0.0255396 -0.0090955 -0.000359 -0.0133992 0.0825382 0.0000878 -0.0003495 0.0000994 0.1319815 0.0594449 -0.032333 -0.0001737 -0.0278806 0.0487114 0.0001268 -0.0001825 0.0001201 0.1319426 0.0296353 0.054428 -0.000465 0.0427789 0.0614006 0.0003061 -0.000441 0.0003412 0.1168707 unknown
polarizability: 290.4545885|82.1386909|199.0229729|0.6535614|-0.1303837|44.3277831 unknown
InChI: InChI=1/14C.10H
charge 1 multiplicity 4
24 atoms
C  -6.77762145 -2.20955519 -0.01457159
C  -5.34354929 -2.18827636 -0.00957717
C  -4.60637124 -0.96893284 -0.01027339
C  -5.33065462 0.26295357 -0.01623848
C  -6.75444085 0.21197314 -0.02115618
C  -7.47068039 -1.03083222 -0.02023789
C  -3.18903843 -0.94185623 -0.00528855
C  -4.61769875 1.48830062 -0.01707086
C  -3.20029939 1.51539196 -0.01204285
C  -2.47612743 0.28343922 -0.00610821
C  -1.05220626 0.33448078 -0.00114239
H  -0.49617708 -0.59837441 0.00342937
C  -0.33609876 1.57713926 -0.00193663
C  -1.02897758 2.75596822 -0.00763932
C  -2.46324257 2.7346481 -0.01274642
H  -2.63877075 -1.87759683 -0.00073047
H  -7.29134518 -3.16422615 -0.01372718
H  -4.79885498 -3.12779468 -0.00510002
H  -7.31027204 1.14494274 -0.02565987
H  -8.55468075 -1.01558438 -0.02409149
H  -5.16796454 2.42403719 -0.02164621
H  0.74789919 1.56168823 0.00201566
H  -0.51507499 3.71054208 -0.0084033
H  -3.00813487 3.67404819 -0.01731555
