program: Gaussian 09
title: 000006941
version: EM64L-G09RevD.01
frameworkgroup: C1[X(C7H5IO2)]
method: RPBEPBE
basis: SDD
operation: Freq
keyword: #pfreq=noraman
keyword: PBEPBE/SDD
title: #p freq=noraman PBEPBE/SDD
converged: YES YES NO NO
title: Mulliken charges:
elementType: I O O C C C C C C C H H H H H
charge: 0.150213 -0.448434 -0.225646 0.320137 -0.452266 -0.300921 -0.148589 -0.220326 -0.212940 0.120404 0.290617 0.257565 0.239920 0.241324 0.388942
chargesum: 0.00000
title: Mulliken charges with hydrogens summed into heavy atoms:
elementType: I O O C C C C C C C
charge: 0.150213 -0.059492 -0.225646 0.320137 -0.452266 -0.010304 0.108976 0.019593 0.028384 0.120404
polarizability: 1.48589617e+02 -1.16633376e+01 1.21278222e+02 -6.99740426e-02 1.79185521e-02 3.54002836e+01
1716.lowfreq: -12.8781 -5.8988 -2.5740 -0.0005 -0.0004 -0.0002 27.7866 105.3903 145.0631
frequency: 27.6512 105.3868 145.0557 191.9864 236.5797 264.5167 392.3786 420.6403 475.9544 491.3738 587.9866 597.1538 635.5178 679.7305 741.6624 750.1889 787.0801 888.3841 976.6120 983.3549 1004.4712 1014.1812 1046.9255 1121.4437 1157.9093 1178.6136 1265.1821 1308.6075 1368.7667 1412.0223 1451.5118 1563.0629 1591.9425 1649.6956 3140.1383 3157.9744 3172.2820 3187.9888 3534.0034
redmass: 13.1865 4.1788 13.2427 5.1259 9.6915 6.7830 8.0673 3.0258 3.8521 7.1403 1.2314 5.0257 6.4911 3.8571 2.2059 5.8717 1.8209 1.3699 1.3821 6.6410 1.3541 6.1163 2.2366 1.6339 1.8436 1.0646 1.4491 2.3745 10.8357 2.0093 2.3910 6.0944 6.3719 8.9896 1.0867 1.0919 1.0971 1.0966 1.0642
irintensity: 1.0241 0.0059 1.1915 4.1441 1.4388 0.2588 5.1755 13.9566 2.5007 13.6409 110.9603 54.0129 18.0045 61.5050 57.0724 5.2841 31.0330 0.2724 2.8355 239.9634 0.1972 76.0684 20.0057 57.1123 74.2354 0.8577 12.8540 62.8246 11.5235 26.0742 46.2879 18.1436 31.7448 226.3293 2.6082 10.1557 10.7088 6.3648 49.9608
temp: 298.150 k
press: 1.00000 atm
elementType: 53 8 8 6 6 6 6 6 6 6 1 1 1 1 1
symmnumber: 1
zpe: 267400.8 jmol-1
zpe.correction: 0.101848 hartree
zpe.thermalcorrener: 0.110782 hartree
zpe.thermalcorrenthalpy: 0.111726 hartree
zpe.thermalcorrgfe: 0.065128 hartree
zpe.sumelectzpe: -430.990214 hartree
zpe.sumelectthermal: -430.981280 hartree
zpe.sumelectthermalent: -430.980335 hartree
zpe.sumelectthermalfe: -431.026934 hartree
dipole: 2.6347 -1.7499 -0.0201
dipole: 3.1629
quadrupole: -63.3354 -60.9882 -75.1099
quadrupole: 1.9103 0.0838 -0.0918
quadrupole: 3.1424 5.4896 -8.6321 1.9103 0.0838 -0.0918
hfenergy: -431.0920616 hartree
pointgroup: C01 [X(C7H5I1O2)]
dipole: -0.8955691 0.8639847 -0.0028 debye
dipolederiv: 0.0087356 0.2293248 0.0053317 0.209251 -0.3945141 -0.0045474 0.0041331 -0.0022032 0.0339162 -0.5159351 -0.4612496 -0.0260332 -0.5060577 -1.1804581 -0.058512 -0.0314627 -0.0578711 -0.4360311 -0.9413469 0.099027 -0.0165979 0.0759536 -0.6633497 -0.0171135 -0.021798 -0.0158035 -0.3061253 -0.7028538 -0.030943 -0.0344794 -0.0208409 -0.3549405 -0.0156945 -0.0340826 -0.0153138 0.0620855 0.310456 -0.6378586 0.0008103 -0.1870487 0.9685969 0.0260874 0.0171542 0.0056711 -0.1510165 0.1496563 0.0806101 0.0143616 -0.0815509 -0.0618686 -0.0019365 0.0065327 0.0047502 -0.1077206 -0.275761 0.3577055 0.0038845 0.3199413 -0.2826545 0.0087549 0.0031499 0.0108729 -0.106742 -0.1244534 -0.2461841 -0.0064645 -0.1346519 -0.0489819 -0.0021182 -0.0032099 -0.0068536 -0.1594928 0.144421 0.0560437 0.0130456 -0.0748913 0.2252401 0.0076706 0.0086782 0.0131308 -0.1126544 1.693992 0.4534939 0.0754404 0.2669699 1.4515015 0.0763404 0.0751205 0.0825739 0.2372154 0.1094985 -0.0131584 -0.0027774 -0.0309598 0.0015867 -0.0064577 -0.0023741 -0.0060706 0.1639977 0.0660439 -0.0476303 -0.0056719 -0.0770279 -0.0218605 -0.009302 -0.0068696 -0.0078462 0.1585506 0.0255157 0.0840318 -0.003222 0.0985016 -0.0496348 -0.0026519 -0.0025115 -0.0031272 0.1622779 -0.1051196 0.00716 -0.0114305 -0.0036446 0.0734887 -0.0029112 -0.0116232 -0.0025834 0.1593524 0.1571509 0.0696272 -0.0061973 0.1460563 0.337849 0.0023916 -0.0008371 0.0006737 0.4023869 unknown
polarizability: 127.2971187|-16.4445536|142.32357|3.4530187|2.8767078|35.6474338 unknown
InChI: InChI=1S/C7H5IO2/c8-6-4-2-1-3-5(6)7(9)10/h1-4,9H
charge 0 multiplicity 1
15 atoms
I  0.578757 -2.947441 -0.018725
O  2.124534 1.730742 0.220031
O  2.600443 -0.531381 0.123777
C  0.255413 0.227667 0.067763
C  -0.407712 -1.033271 -0.002873
C  -0.543167 1.410415 0.072264
C  -1.820487 -1.089801 -0.066476
C  -1.945924 1.352236 0.008223
C  -2.587574 0.094916 -0.061443
C  1.738511 0.376249 0.135661
H  -0.026347 2.371287 0.127243
H  -2.320498 -2.060667 -0.120342
H  -2.533262 2.275895 0.012992
H  -3.679663 0.027633 -0.111545
H  3.117577 1.764521 0.260652
