program: Gaussian 16
title: IMes=N-N=C(H)(CO2Me)
version: ES64L-G16RevC.01
method: RMN15
basis: GenECP
operation: Freq
keyword: #P
keyword: Geom=AllCheck
keyword: Guess=TCheck
keyword: SCRF=Check
keyword: GenChk
keyword: RMN15/GenECP
keyword: Freq
converged: YES YES NO YES
title: Mulliken charges:
elementType: N N C H C O C H H H O C N C C H H N C C C C C C H H C C C C C C H H C H H H C H H H C H H H C H H H C H H H C H H H
charge: -0.286954 0.473947 0.176575 -0.399148 0.680895 -1.149977 1.780721 -0.411463 -0.344498 -0.020391 -0.422929 0.514580 -0.900365 1.232856 1.275635 -0.684066 -0.648945 -0.984079 -0.442446 -1.201195 -1.018213 -0.776531 -0.236850 -1.035468 -0.105125 -0.183648 -0.791759 -1.072005 -1.455890 -0.236816 -0.300323 -1.253031 -0.113376 -0.505580 1.978832 -0.012205 -0.225598 0.078562 1.718685 -0.088859 -0.056507 -0.006089 1.788552 -0.048424 -0.053660 0.039069 2.549315 -0.370892 -0.190385 -0.012951 1.746959 0.054987 -0.026765 -0.052540 2.108463 0.085667 -0.108317 -0.050036
chargesum: -0.00000
title: Mulliken charges with hydrogens summed into heavy atoms:
elementType: N N C C O C O C N C C N C C C C C C C C C C C C C C C C C C
charge: -0.286954 0.473947 -0.222572 0.680895 -1.149977 1.004368 -0.422929 0.514580 -0.900365 0.548790 0.626690 -0.984079 -0.442446 -1.201195 -1.018213 -0.881656 -0.420499 -1.035468 -0.791759 -1.072005 -1.455890 -0.350192 -0.805903 -1.253031 1.819592 1.567230 1.725537 1.975086 1.722641 2.035776
polarizability: 3.60606603e+02 -4.11911350e+01 3.04098497e+02 -3.06771018e+01 6.37779204e+01 3.07009414e+02
1716.lowfreq: -5.2802 -1.8367 -1.0427 -0.0013 -0.0005 0.0008 19.7051 21.6644 26.4296
frequency: 19.7022 21.6527 26.4286 32.9300 42.1098 52.5257 65.4318 68.7587 75.6579 85.3794 93.2097 95.0071 104.1594 107.8660 117.4597 131.7495 137.9805 143.0601 151.7672 153.1864 178.2646 182.7007 197.3951 201.5519 205.7859 212.7520 230.6811 237.2064 252.1774 270.6926 273.6906 283.7641 297.0808 314.1840 326.0571 368.5534 381.9561 400.8545 409.6868 462.8252 486.9096 492.4948 493.5235 503.6454 516.7827 517.3019 546.9787 553.0727 574.2838 582.1036 583.0518 585.2334 595.7948 606.9817 643.1774 681.5734 683.0154 739.9049 746.3918 759.7518 762.9426 787.0648 861.5108 869.1906 870.3106 897.5890 910.3618 936.0092 940.4381 946.5944 947.7034 969.7436 970.5576 976.2292 1010.6433 1012.6235 1019.9376 1021.8142 1034.9646 1035.1216 1038.7375 1039.7736 1041.0340 1046.4989 1054.0386 1056.4371 1077.1928 1086.2185 1086.2455 1099.3041 1166.1821 1172.0133 1172.9554 1178.9125 1198.1164 1244.0012 1244.0596 1255.8278 1279.2945 1308.5944 1323.2831 1331.8168 1347.6077 1353.8414 1359.0857 1371.3347 1372.0241 1374.2704 1376.2813 1395.4650 1396.1924 1408.5847 1422.0185 1423.9327 1425.1367 1427.2209 1433.4271 1435.5175 1437.3576 1438.2746 1440.1427 1441.7020 1442.7759 1443.7387 1446.1401 1452.4950 1456.6527 1463.3917 1476.0485 1495.4252 1496.4056 1550.4475 1557.4562 1625.4224 1670.8731 1671.3273 1689.0256 1689.9843 1807.5974 2299.0091 3055.0656 3063.0603 3064.9613 3065.4264 3066.4193 3070.5011 3085.8194 3132.8860 3141.1161 3141.4210 3144.3514 3145.3654 3149.2318 3167.7748 3170.6455 3171.0264 3171.7460 3173.7188 3174.0049 3174.9047 3193.6958 3198.1183 3198.5023 3200.0035 3213.5334 3286.0666 3298.9711 3320.8887
redmass: 5.9845 4.5172 4.4767 5.0433 4.3462 4.5830 4.6029 4.2222 4.0273 3.9402 1.5236 2.0877 2.0874 1.3535 2.9451 2.1824 1.6943 3.7538 1.1455 1.1703 1.4605 2.3325 3.5897 2.0207 2.1935 1.7407 3.7762 2.4428 2.7229 2.5463 2.5262 2.7951 4.2608 5.2081 2.9147 3.7717 4.7336 6.3737 4.5182 4.1398 6.5295 3.4370 3.5570 1.3410 3.0176 3.0112 4.4408 3.6939 11.9222 3.8683 3.9244 3.7765 3.9433 2.9664 4.6482 4.2903 4.3650 5.3388 1.3926 4.3099 8.8361 3.4531 1.2430 1.2721 1.3872 1.2969 1.2928 4.1139 2.9920 1.8956 1.9601 3.1233 3.1681 4.4452 1.5190 1.5294 1.7274 1.6996 1.5742 1.5582 1.5662 1.6004 1.5481 1.6942 2.2213 2.1899 1.2654 5.2828 2.3594 6.3136 1.2975 1.3918 1.4422 1.3352 1.5928 1.3110 1.3155 2.2760 8.1008 7.5048 2.2198 2.1313 5.2448 4.3486 4.0437 1.3022 1.2871 1.3887 1.4281 2.0921 2.0266 2.3665 1.2848 1.3605 1.4206 1.3041 1.0544 1.0468 1.0493 1.1158 1.0428 1.0499 1.0676 1.0898 1.0963 1.3369 1.1869 2.2160 2.3644 2.9773 2.9305 5.4297 5.6289 5.8207 8.8266 8.8486 7.4799 7.5140 11.9383 13.6053 1.0387 1.0385 1.0373 1.0381 1.0376 1.0376 1.0316 1.1017 1.1014 1.1009 1.1013 1.1014 1.1021 1.1037 1.1034 1.1033 1.1035 1.1052 1.1035 1.1042 1.0915 1.0914 1.0914 1.0914 1.1066 1.0906 1.0905 1.1120
irintensity: 0.1166 0.2675 0.3350 0.7025 0.9694 3.0733 1.0327 1.4650 0.7324 0.3246 0.2409 1.5832 0.0895 0.2653 0.5606 2.1552 0.7204 0.8672 0.4538 0.0454 3.2381 4.2579 10.3250 1.3688 3.7193 0.0106 2.4983 0.2273 0.2727 0.2882 1.1128 5.5820 12.7170 4.4332 0.1277 0.2659 0.2717 5.4024 0.8574 6.6366 1.8051 1.2205 0.3668 37.1890 0.5385 0.5852 0.1119 0.0331 1.8781 2.5208 0.0802 2.9853 0.9712 1.0917 5.7167 2.8472 7.5883 8.4101 31.3731 5.2890 58.1827 5.1028 20.9143 14.5682 0.5888 1.8006 1.0891 30.5619 1.3857 5.7423 2.9931 0.7528 0.0869 4.3998 7.8209 5.3045 3.8433 1.5105 0.3062 0.3160 1.6773 8.7193 0.4391 5.9761 0.1315 0.7030 14.2700 9.6956 4.0611 0.1055 0.8170 1.3958 42.9356 0.1369 1.8625 0.8761 0.0420 33.3474 307.8495 5.3674 0.1169 2.6882 3.0486 8.9969 3.9173 0.2139 6.9872 1.2666 11.3425 0.2665 0.4968 0.7145 13.4040 17.2155 93.2018 15.7671 7.8840 9.2741 11.3662 13.4263 7.8822 5.1373 15.3038 14.3125 3.7064 8.4502 23.8575 12.1466 312.7546 14.3357 21.5621 228.3531 8.7187 2.0678 1.1565 17.1470 10.2482 2.2954 234.8548 383.4521 14.3726 28.9400 18.0603 27.1182 5.5093 32.4805 36.0966 10.0305 8.7333 12.4389 4.9985 6.8627 11.4798 24.1643 13.1050 15.7505 17.0858 13.1190 19.7212 18.6187 16.8484 19.4580 14.9347 17.8365 11.0790 5.7701 2.4924 0.0357
temp: 298.150 k
press: 1.00000 atm
elementType: 7 7 6 1 6 8 6 1 1 1 8 6 7 6 6 1 1 7 6 6 6 6 6 6 1 1 6 6 6 6 6 6 1 1 6 1 1 1 6 1 1 1 6 1 1 1 6 1 1 1 6 1 1 1 6 1 1 1
symmnumber: 1
zpe: 1249144.2 jmol-1
zpe.correction: 0.475774 hartree
zpe.thermalcorrener: 0.507936 hartree
zpe.thermalcorrenthalpy: 0.508880 hartree
zpe.thermalcorrgfe: 0.410290 hartree
zpe.sumelectzpe: -1297.759766 hartree
zpe.sumelectthermal: -1297.727605 hartree
zpe.sumelectthermalent: -1297.726660 hartree
zpe.sumelectthermalfe: -1297.825250 hartree
dipole: -0.8064 0.0633 2.1333
dipole: 2.2815
quadrupole: -163.9065 -165.7077 -174.4055
quadrupole: -6.2407 -2.2771 5.0250
quadrupole: 4.1001 2.2989 -6.3990 -6.2407 -2.2771 5.0250
hfenergy: -1298.2355403 hartree
pointgroup: C01 [X(C24H28N4O2)]
dipole: -0.3172727 0.0248982 0.8393021 debye
polarizability: 360.6066033|-41.191135|304.0984967|-30.6771018|63.7779204|307.0094141 unknown
InChI: InChI=1S/C21H24N2.C3H4N2O2/c1-14-9-16(3)20(17(4)10-14)22-7-8-23(13-22)21-18(5)11-15(2)12-19(21)6;1-7-3(6)2-5-4/h7-12H,1-6H3;2H,1H3
charge 0 multiplicity 1
58 atoms
N  0.93021406 2.61687585 -1.00258425
N  -0.14954161 2.86499327 -0.78546912
C  -1.39656023 3.18171615 -0.52854026
H  -1.5798966 4.16296948 -0.10180894
C  -2.43482448 2.2000844 -0.76223677
O  -3.63420583 2.69509035 -0.39288295
C  -4.72468387 1.79941275 -0.52652599
H  -4.54085412 0.88873053 0.05919806
H  -5.6061839 2.32678969 -0.15211111
H  -4.86267701 1.51310814 -1.57661055
O  -2.29483769 1.0877831 -1.23070564
C  0.77415977 -0.43400194 0.17928483
N  1.31694143 -1.67836854 0.06819335
C  0.60028452 -1.61502314 2.14113267
C  1.22409312 -2.41742386 1.2424726
H  0.31790233 -1.77590459 3.17585384
H  1.60337237 -3.43022707 1.32321509
N  0.33938614 -0.42508406 1.47175586
C  1.83019033 -2.19143761 -1.1630247
C  0.91636974 -2.54647649 -2.16792427
C  3.21239593 -2.32069278 -1.3293016
C  1.43068381 -3.0583901 -3.36005911
C  3.68222967 -2.84034913 -2.54075487
C  2.80777771 -3.21441514 -3.5641412
H  0.73656893 -3.34346563 -4.15431787
H  4.75945836 -2.94384567 -2.69015431
C  -0.43353489 0.65833514 1.9917062
C  0.21524274 1.81728844 2.42834892
C  -1.83155718 0.53060535 1.99823113
C  -0.57880509 2.88713868 2.85988087
C  -2.58171255 1.61850181 2.44463301
C  -1.97397644 2.81058995 2.85843722
H  -0.09210179 3.80639887 3.19449936
H  -3.67257075 1.55069747 2.43873751
C  -0.56042245 -2.36390668 -1.95134182
H  -0.87666135 -2.82782066 -1.00469945
H  -0.81774962 -1.29603008 -1.88110469
H  -1.13076157 -2.81474988 -2.77143771
C  4.14967719 -1.88119669 -0.23833508
H  3.90154686 -0.86272411 0.0935004
H  4.07453146 -2.53129476 0.64554864
H  5.18883844 -1.89812922 -0.58634503
C  3.3225723 -3.768437 -4.86593051
H  2.90855452 -4.76821244 -5.05843334
H  3.02838931 -3.12690035 -5.70854579
H  4.41635898 -3.84664603 -4.86269098
C  -2.47245203 -0.7270916 1.48152552
H  -2.17759285 -0.88844016 0.43396508
H  -2.15511442 -1.60891312 2.05402334
H  -3.56531872 -0.66118825 1.53429619
C  1.71628551 1.89427122 2.40174258
H  2.16165535 1.06289447 2.96667672
H  2.08530914 1.80820047 1.3695846
H  2.06882693 2.8394152 2.83012568
C  -2.82786412 3.989493 3.23849599
H  -2.21835416 4.84389586 3.55617738
H  -3.43843529 4.30127508 2.37762717
H  -3.51939136 3.73668604 4.05394908
