program: AMS
title: Ag and Au
programVersion: 2024.101
runtype: SINGLE POINT
method: DFT
functional: TPSSh == Not Default ==
basis: TZP
functional: VWN
spinMolecule: Restricted
epsl: 46.70000
solvent: DMSO angstrom
formula: NO3
InChI: InChI=1/N.3O
4 atoms
O  1.255295 -0.000000 0.000000
N  0.000000 0.000000 0.000000
O  -0.627648 1.087117 0.000000
O  -0.627648 -1.087117 0.000000
elementType: O N O O
mdcq: -0.66055269 0.75382737 -0.54663734 -0.54663734
eener: -28.147806 electronvolt
kinener: 32.095088 electronvolt
coulombener: 3.502795 electronvolt
xcener: -38.126405 electronvolt
solvener: -2.879973 electronvolt
dispener: -0.072730 electronvolt
total: -33.629039 electronvolt
charge: -0.61291359 0.83874076 -0.61291359 -0.61291359
dipole: 0.00000015 -0.00000000 -0.00000000
dipole: 0.000000
quadrupole: -2.78505466 0.00000000 -0.00000000 -2.78505450 -0.00000000 5.57010916
energy: -518.790690 -394.613917 -32.735585 -15.772898 4.623409 11.161492 13.932442 26.016988 46.871499 56.507182 66.777327 153.199728 237.130979 421.323620 1872.679419 3488.129932 -6.084731 17.496471 49.916633 121.455335 -518.790978 -26.923299 -13.271964 -8.058105 6.134368 9.120175 13.272582 18.224737 31.808464 43.054504 48.472814 58.918671 76.960167 113.540857 128.503442 198.258303 428.725970 3516.210316 -518.790978 -26.923299 -13.271964 -8.058105 6.134368 9.120175 13.272582 18.224737 31.808464 43.054504 48.472814 58.918671 76.960167 113.540857 128.503442 198.258303 428.725970 3516.210316 36.434836 -13.808297 -1.080716 8.500286 19.428567 48.431698 95.216919 129.512686 -7.533524 13.552077 25.390683 36.449353 65.432028 119.166898 -7.533524 13.552077 25.390683 36.449353 65.432028 119.166898 electronvolt
charge: -1
energy: -518.7907 -518.7904 -394.6137 -32.7356 -26.9233 -15.7729 -13.8083 -13.2720 -8.0581 -7.5335 -6.0847 -1.0807 4.6234 6.1344 8.5003 9.1202 11.1615 13.2726 13.5521 13.9324 17.4965 18.2247 19.4286 25.3907 26.0170 31.8084 36.4348 36.4493 43.0545 46.8715 48.4317 48.4728 49.9166 56.5072 58.9186 65.4320 66.7773 76.9601 95.2169 113.5408 119.1668 121.4553 128.5034 129.5126 153.1996 198.2582 237.1309 421.3234 428.7257 1872.6784 3488.1281 3516.2084 electronvolt
