program: AMS
title: Ag and Au
programVersion: 2024.101
runtype: SINGLE POINT
method: DFT
functional: TPSSh == Not Default ==
basis: TZP
functional: VWN
spinMolecule: Restricted
epsl: 46.70000
solvent: DMSO angstrom
formula: C2H6OS
InChI: InChI=1/2C.O.S.6H
10 atoms
S  0.284087 0.380053 0.000000
O  -1.075855 1.050425 0.000000
C  0.251825 -0.799100 1.334018
C  0.251825 -0.799100 -1.334018
H  1.174675 -1.396771 1.297693
H  1.174675 -1.396771 -1.297693
H  0.215100 -0.226754 2.270858
H  0.215100 -0.226754 -2.270858
H  -0.639883 -1.435221 1.225352
H  -0.639883 -1.435221 -1.225352
elementType: S O C C H H H H H H
mdcq: 0.15877589 -0.66319934 0.36809323 0.36809324 -0.07220715 -0.07220716 -0.02176073 -0.02176073 -0.02191363 -0.02191363
eener: -35.882877 electronvolt
kinener: 53.737508 electronvolt
coulombener: -19.095827 electronvolt
xcener: -53.956704 electronvolt
solvener: -0.604338 electronvolt
dispener: -0.228844 electronvolt
total: -56.031089 electronvolt
charge: 0.73421140 -0.84585675 0.37137740 0.37137740 -0.09878392 -0.09878392 -0.12199835 -0.12199835 -0.09477246 -0.09477246
dipole: 1.49933547 -1.80475311 -0.00000000
dipole: 1.804753
quadrupole: -3.62467435 2.92725055 -0.00000000 -1.92207878 0.00000000 5.54675313
energy: -2424.254003 -518.071149 -276.020529 -217.514935 -160.377387 -160.150523 -27.123069 -21.323217 -15.936690 -12.353399 -12.111851 -10.747318 -9.415507 -6.270564 0.328843 0.605795 1.658932 1.746389 1.776346 4.354689 4.408960 5.400178 6.119905 6.897617 9.209073 9.562267 11.090747 11.374618 11.847307 12.819320 14.993080 16.456278 19.430313 19.844984 22.809576 23.177032 27.286095 29.185141 29.798211 31.466780 33.259850 34.141823 36.246476 38.186711 40.610437 43.119920 45.980599 48.175735 54.206225 55.463209 58.206123 62.417740 62.512932 65.661545 68.325607 71.264457 74.199331 89.498211 99.611999 116.748098 117.847422 122.936065 134.447795 192.560433 371.811937 378.074633 386.955704 430.712397 1507.780131 3506.348891 5409.881211 -276.020575 -160.333435 -19.103337 -12.029690 -10.974808 -10.153376 -7.379625 0.577069 1.848449 2.877208 3.289168 4.610290 5.288824 8.053730 9.031181 11.866848 12.285470 12.544239 13.299227 16.908570 18.934807 20.018558 21.006409 25.995295 28.572194 29.511142 30.904945 33.078259 36.545425 38.059007 39.153428 41.335767 43.343292 48.341430 55.652819 57.808596 60.013844 63.352511 65.358988 74.959805 85.299245 88.357696 102.806042 119.844023 121.780052 126.947576 199.632187 376.972451 1526.902840 electronvolt
charge: 0
energy: -2424.2527 -518.0709 -276.0204 -276.0204 -217.5148 -160.3773 -160.3333 -160.1504 -27.1231 -21.3232 -19.1033 -15.9367 -12.3534 -12.1118 -12.0297 -10.9748 -10.7473 -10.1534 -9.4155 -7.3796 -6.2706 0.3288 0.5771 0.6058 1.6589 1.7464 1.7763 1.8484 2.8772 3.2892 4.3547 4.4090 4.6103 5.2888 5.4002 6.1199 6.8976 8.0537 9.0312 9.2091 9.5623 11.0907 11.3746 11.8473 11.8668 12.2855 12.5442 12.8193 13.2992 14.9931 16.4563 16.9086 18.9348 19.4303 19.8450 20.0185 21.0064 22.8096 23.1770 25.9953 27.2861 28.5722 29.1851 29.5111 29.7982 30.9049 31.4668 33.0782 33.2598 34.1418 36.2465 36.5454 38.0590 38.1867 39.1534 40.6104 41.3357 43.1199 43.3433 45.9806 48.1757 48.3414 54.2062 55.4632 55.6528 57.8086 58.2061 60.0138 62.4177 62.5129 63.3525 65.3590 65.6615 68.3256 71.2644 74.1993 74.9598 85.2992 88.3576 89.4982 99.6119 102.8060 116.7480 117.8474 119.8440 121.7800 122.9360 126.9475 134.4477 192.5603 199.6321 371.8117 376.9723 378.0744 386.9555 430.7122 1507.7793 1526.9020 3506.3470 5409.8783 electronvolt
