program: Gaussian 09
title: 000051378
version: EM64L-G09RevD.01
frameworkgroup: C1[X(C12H4Cl4O2)]
method: RPBEPBE
basis: SDD
operation: Freq
keyword: #p
keyword: freq=noraman
keyword: PBEPBE/SDD
title: #p freq=noraman PBEPBE/SDD
converged: NO NO NO NO
title: Mulliken charges:
elementType: Cl Cl Cl Cl O O C C C C C C C C C C C C H H H H
charge: 0.047431 0.017782 -0.000302 0.011103 -0.240121 -0.263042 0.446960 0.450903 0.398857 0.278279 -0.329583 -0.363602 -0.321543 -0.376455 -0.107818 -0.259297 -0.246266 -0.208246 0.271473 0.286990 0.262378 0.244118
chargesum: 0.00000
title: Mulliken charges with hydrogens summed into heavy atoms:
elementType: Cl Cl Cl Cl O O C C C C C C C C C C C C
charge: 0.047431 0.017782 -0.000302 0.011103 -0.240121 -0.263042 0.446960 0.450903 0.398857 0.278279 -0.329583 -0.363602 -0.321543 -0.104982 -0.107818 0.027693 0.016112 0.035872
polarizability: 2.67233751e+02 -1.61669608e+00 2.14360027e+02 4.41878834e-04 -5.05937800e-03 6.13576551e+01
1716.lowfreq: -2.6548 -0.0011 0.0026 0.0034 5.7504 9.1545 31.3225 46.3198 75.0135
frequency: 31.3117 46.3172 75.0122 101.5136 141.9967 157.1863 161.7416 173.9999 192.3567 222.0491 272.9652 286.4868 300.1219 323.5938 337.2057 353.6157 381.1023 468.8879 495.9275 511.7534 518.9089 529.9494 554.9404 571.4499 584.6191 585.2891 675.3799 680.4393 698.8652 740.4403 769.8684 805.5168 837.4697 866.6107 884.2159 902.0733 925.1039 959.5158 1056.2849 1110.2533 1115.3433 1163.1021 1175.2491 1206.5254 1220.1625 1263.4084 1357.0008 1374.2874 1398.5646 1419.2597 1441.8597 1451.6750 1561.9040 1569.3394 1597.9529 1619.9273 3158.5022 3175.5075 3186.1090 3187.3776
redmass: 13.3659 10.4172 24.0105 20.0947 11.1272 9.9545 20.7253 22.4938 26.0779 5.8739 6.2524 7.2348 16.2675 21.5128 11.7946 7.6936 15.1347 10.1815 9.4671 4.6790 4.9281 4.8699 8.2601 10.1866 11.8751 9.8845 4.9639 8.2533 6.2164 10.5203 1.3274 7.7906 1.3975 9.0650 1.3594 10.0379 11.3112 1.3074 2.0946 4.7165 6.8435 1.2442 1.9439 2.2723 2.4696 3.6368 11.1398 9.0484 6.7095 4.8419 2.7428 3.8214 9.0781 9.3151 8.3786 9.5977 1.0872 1.0928 1.0932 1.0996
irintensity: 0.5651 1.2388 0.1035 0.5118 0.5312 0.0587 0.0655 0.3415 0.0250 0.2584 0.4654 0.5402 1.2097 0.7649 0.2440 0.8060 1.8862 1.6102 6.8382 2.5419 0.0005 8.2715 1.4005 7.9592 2.0958 12.3427 6.0315 4.5773 7.8932 16.1452 74.2769 35.0026 20.4066 75.0388 1.0676 31.6218 196.8661 1.3789 17.9186 0.4227 44.1396 0.0790 22.4700 15.2431 3.4285 180.1815 97.6971 71.2792 54.5919 441.1209 139.0358 180.0944 31.2723 10.1828 45.3614 2.0960 5.0735 0.9259 3.2253 3.3409
temp: 298.150 k
press: 1.00000 atm
elementType: 17 17 17 17 8 8 6 6 6 6 6 6 6 6 6 6 6 6 1 1 1 1
symmnumber: 1
zpe: 328586.6 jmol-1
zpe.correction: 0.125152 hartree
zpe.thermalcorrener: 0.140568 hartree
zpe.thermalcorrenthalpy: 0.141513 hartree
zpe.thermalcorrgfe: 0.080766 hartree
zpe.sumelectzpe: -2449.085283 hartree
zpe.sumelectthermal: -2449.069866 hartree
zpe.sumelectthermalent: -2449.068922 hartree
zpe.sumelectthermalfe: -2449.129668 hartree
dipole: 1.6145 -1.7274 0.0001
dipole: 2.3644
quadrupole: -123.0612 -125.0540 -131.9772
quadrupole: -14.7254 0.0005 -0.0003
quadrupole: 3.6363 1.6435 -5.2798 -14.7254 0.0005 -0.0003
hfenergy: -2449.2104347 hartree
pointgroup: C01 [X(C12H4Cl4O2)]
dipole: 0.7516376 -0.5480683 0.0000584 debye
dipolederiv: -0.0349026 -0.1006876 0.0000036 -0.1903911 -0.5945777 0.0000211 0.0000104 0.0000277 0.0121858 -0.0701076 -0.1003984 0.0000069 -0.0564109 -0.6657727 0.0000359 0.0000045 0.0000323 -0.0101026 -0.1273614 -0.1360224 -0.0000022 -0.23761 -0.6042176 -0.0000065 -0.0000029 -0.0000096 -0.0229799 -0.758995 -0.1708232 0.0000154 -0.1818817 -0.1014207 0.000005 0.0000264 0.000005 -0.0188445 -1.9694958 0.2178718 -0.0000392 0.3185201 -0.2840464 0.00002 -0.000028 0.0000262 -0.1117651 -1.9373709 0.2388826 -0.0000383 0.3655353 -0.3933067 0.0000031 -0.0000583 -0.0000087 -0.1331904 1.3497669 -0.0906094 0.0000095 0.7029035 -0.2724682 0.0000252 -0.0000253 0.0000152 0.0941848 0.9708562 -0.241563 -0.0000034 -1.1121071 0.1696629 -0.0000066 0.0000246 0.000009 0.1382173 0.8837804 -0.305168 0.0000445 -1.1817856 0.0264965 -0.0000445 0.000071 -0.0000279 0.1013961 1.3798338 -0.0755828 0.0000553 0.6112923 0.0967154 0.000013 0.0000501 0.0000011 0.0749367 -0.3496009 0.2203651 -0.0000079 0.2213482 0.8848937 -0.0000269 -0.0000051 -0.0000427 -0.1009301 0.0362263 0.1832368 -0.0000231 0.0682617 1.0668799 -0.0000648 -0.0000197 -0.0000632 -0.0993207 0.052672 0.2347551 0.0000026 0.4296507 0.965685 0.0000177 0.0000018 0.0000202 -0.0862862 -0.3001023 0.0218131 -0.0000029 0.084925 0.0043563 0.0000009 -0.0000165 0.0000065 -0.1609702 1.0932136 0.124637 -0.0000255 0.2960817 0.0457024 -0.0000096 -0.0000459 -0.0000013 -0.0437184 -0.3561166 -0.0630743 0.0000097 -0.1086444 -0.3072373 0.0000182 0.000012 0.0000151 -0.058886 -0.0705157 -0.000405 -0.0000014 -0.0521209 -0.2658216 -0.0000075 -0.0000008 -0.0000073 -0.1131356 0.0822743 0.0290117 0.0000063 -0.0012668 0.0714302 -0.0000091 0.0000167 -0.0000093 -0.1501583 0.0957497 -0.0542128 -0.0000022 -0.0340364 0.005169 0.0000039 -0.0000023 -0.0000026 0.1807657 0.0663534 0.0231346 0.0000014 0.0237045 0.0638916 0.0000024 -0.0000005 0.0000043 0.1728332 -0.0172152 -0.0370954 -0.0000026 -0.0488788 0.0850857 0.0000008 -0.0000058 -0.0000016 0.1702974 -0.0189426 0.0819345 -0.0000066 0.0829107 0.0029001 0.0000083 -0.0000062 0.0000116 0.1654711 unknown
polarizability: 265.9614594|8.2623117|215.6323194|0.0013853|-0.004886|61.3576551 unknown
InChI: InChI=1S/C12H4Cl4O2/c13-5-2-1-3-8-10(5)18-11-7(15)4-6(14)9(16)12(11)17-8/h1-4H
charge 0 multiplicity 1
22 atoms
Cl -2.5885 -2.832161 0.00012
Cl -1.325261 3.463951 -0.000137
Cl 3.424237 2.471118 0.000111
Cl -5.037928 -0.644287 0.000105
O  0.688609 1.259436 -0.000067
O  0.090409 -1.587933 0.000002
C  -0.636434 0.772156 -0.000027
C  -0.930264 -0.615217 0.000003
C  1.713241 0.280134 0.000034
C  1.429666 -1.106822 0.000074
C  -2.267099 -1.063141 0.000046
C  -1.693841 1.699552 -0.000041
C  3.055365 0.701551 0.000084
C  2.457867 -2.059724 0.000165
C  -3.313104 -0.111266 0.000047
C  -3.03476 1.267829 0.00001
C  4.106409 -0.240243 0.000132
C  3.801402 -1.618665 0.000174
H  2.195864 -3.12098 0.000185
H  -3.848792 1.996173 0.000011
H  5.142127 0.109664 0.000144
H  4.613487 -2.351425 0.000222
