program: Gaussian 16
title: Title Card Required
version: ES64L-G16RevC.01
frameworkgroup: C2V[SGV(C4),SGV'(C2H2),X(H4)]
method: UM062X
basis: 6-311G(d)
operation: Freq
keyword: #P
keyword: Geom=AllCheck
keyword: Guess=TCheck
keyword: SCRF=Check
keyword: GenChk
keyword: UM062X/6-311G(d)
keyword: Freq
converged: YES YES NO YES
polarizability: 7.30786604e+01 -3.67250640e-08 5.11053198e+01 -5.50451773e-07 2.70113800e-08 6.29209466e+01
1716.lowfreq: 0.0005 0.0006 0.0006 11.9405 17.0214 23.0982 313.2969 424.2627 487.5998
frequency: 313.2916 424.2623 487.5998 692.5930 770.0389 798.9656 813.4953 825.2440 854.0958 928.6157 955.8971 1002.8434 1005.4728 1046.9896 1097.4066 1114.1890 1206.7444 1225.0734 1232.7702 1269.2866 1335.7221 1363.6042 1508.4121 1525.0194 3104.2171 3109.0220 3155.8524 3171.0204 3208.8888 3210.3712
redmass: 1.7855 2.4205 2.5091 6.4395 3.5074 1.1526 4.0119 1.3632 4.2788 2.8854 2.1147 1.3363 5.4877 2.1740 1.1712 1.6767 1.1454 1.2667 2.0454 1.3680 7.3703 5.3917 1.0854 1.1084 1.0566 1.0593 1.1119 1.1102 1.0926 1.0929
irintensity: 0.0000 0.0770 42.6409 1.5039 23.8903 151.3064 0.0000 148.6295 29.3292 50.2255 27.5664 0.0000 9.0553 27.0069 7.2365 0.0000 0.0000 38.3673 0.1129 8.4287 2.1106 2.9871 0.9886 0.0004 33.5867 37.3827 0.0000 15.9394 31.4181 6.3333
temp: 298.150 k
press: 1.00000 atm
elementType: 6 6 6 1 1 1 6 6 6 1 1 1
symmnumber: 2
zpe: 255743.7 jmol-1
zpe.correction: 0.097408 hartree
zpe.thermalcorrener: 0.101986 hartree
zpe.thermalcorrenthalpy: 0.102931 hartree
zpe.thermalcorrgfe: 0.070705 hartree
zpe.sumelectzpe: -231.832010 hartree
zpe.sumelectthermal: -231.827431 hartree
zpe.sumelectthermalent: -231.826487 hartree
zpe.sumelectthermalfe: -231.858712 hartree
hfenergy: -231.9294174 hartree
pointgroup: C02V [SGV(C4),SGV'(C2H2),X(H4)]
dipole: 0. 0. 1.3335948 debye
dipolederiv: 0.1499051 0. 0. 0. -0.1167413 -0.1039134 0. 0.6790649 -0.0862292 -0.3925559 0. -0.4348438 0. -0.1629134 0. -0.1643968 0. -0.2165499 0.1059197 0. -0.5739577 0. 0.3003061 0. -0.1314201 0. 0.019289 0.0186331 -0.0496775 0.0842578 -0.0839453 -0.0389726 0.0719106 0.0631236 0.0047065 0.0338808 0.0186331 0.0496775 0.0842578 0.0839453 -0.0389726 -0.0719106 0.0631236 -0.0047065 0.0338808 0.0186331 -0.0496775 -0.0842578 -0.0839453 -0.0389726 -0.0719106 -0.0631236 -0.0047065 0.0338809 0.1059197 0.0000001 0.5739577 0. 0.3003061 0. 0.1314201 0. 0.019289 -0.3925559 0. 0.4348438 0. -0.1629133 0. 0.1643968 0. -0.2165499 0.1499051 0. 0. 0. -0.1167414 0.1039134 0. -0.679065 -0.0862293 0.099465 0. 0. 0. 0.0572938 -0.0538366 0. -0.3552255 0.2157283 0.099465 0. 0. 0. 0.0572938 0.0538366 0. 0.3552255 0.2157284 0.0186331 0.0496775 -0.0842578 0.0839453 -0.0389726 0.0719106 -0.0631236 0.0047065 0.0338808 unknown
polarizability: 51.1053198|0.|73.0786604|0.|0.0000006|62.9209466 unknown
InChI: InChI=1/6C.6H
charge 0 multiplicity 1
12 atoms
C  0.0000 1.12710761 -0.96819463
C  0.78952164 0.0000 -0.49139828
C  -0.79749042 0.0000 1.06373025
H  -1.24113861 -0.88838028 1.51310964
H  -1.24113861 0.88838028 1.51310964
H  1.24113861 0.88838028 1.51310964
C  0.79749042 0.0000 1.06373025
C  -0.78952164 0.0000 -0.49139828
C  0.0000 -1.12710761 -0.96819463
H  0.0000 2.08365622 -0.45690092
H  0.0000 -2.08365622 -0.45690092
H  1.24113861 -0.88838028 1.51310964
