program: Gaussian 16
title: Title Card Required
version: ES64L-G16RevC.01
frameworkgroup: C1[X(C6H6)]
method: RM062X
basis: 6-311G(d)
operation: Freq
keyword: #P
keyword: Geom=AllCheck
keyword: Guess=TCheck
keyword: SCRF=Check
keyword: Test
keyword: GenChk
keyword: RM062X/6-311G(d)
keyword: Freq
converged: YES YES YES YES
title: Mulliken charges:
elementType: C C C H H H C C C H H H
charge: -0.023147 -0.162648 -0.785553 0.232214 0.247115 0.245716 -0.435401 -0.181015 0.079714 0.269407 0.258814 0.254783
chargesum: 0.00000
title: Mulliken charges with hydrogens summed into heavy atoms:
elementType: C C C C C C
charge: -0.023147 -0.162648 -0.060509 0.078197 0.088393 0.079714
polarizability: 7.29908525e+01 -5.97120654e+00 5.99090836e+01 7.30127283e-01 -2.58230705e+00 4.87597694e+01
1716.lowfreq: -495.0912 -9.4986 -5.5895 -0.0007 -0.0006 0.0001 11.6569 158.6292 165.2928
frequency: -495.0906 158.5942 165.2897 292.4337 379.0789 472.6310 636.7052 722.1040 737.3644 810.3412 879.3347 953.3995 975.7917 1036.2731 1091.5478 1103.3884 1124.1176 1202.1187 1416.0396 1431.4318 1504.9381 1511.0417 1534.4131 1668.3746 3071.8583 3137.0322 3139.0670 3155.0631 3245.1608 3333.1623
redmass: 4.7681 1.0498 2.5421 2.4819 3.0030 2.9876 4.1542 1.2488 2.5092 1.6235 1.3135 2.4023 2.6320 1.3966 1.5456 2.4696 2.2062 3.9915 1.3770 1.5695 1.0437 1.0472 2.2199 9.3385 1.0364 1.0551 1.1011 1.1023 1.1184 1.1046
irintensity: 23.4236 1.2461 3.8866 8.2871 2.6606 23.8693 2.6087 25.8134 21.8840 7.7015 5.7078 6.9642 2.1089 17.1053 0.1914 1.2175 5.8762 1.1124 0.2016 1.9571 8.3545 8.3854 4.1669 1.0098 39.2214 8.6166 16.7104 11.5258 3.3226 25.9577
temp: 298.150 k
press: 1.00000 atm
elementType: 6 6 6 1 1 1 6 6 6 1 1 1
symmnumber: 1
zpe: 244565.1 jmol-1
zpe.correction: 0.093150 hartree
zpe.thermalcorrener: 0.098946 hartree
zpe.thermalcorrenthalpy: 0.099891 hartree
zpe.thermalcorrgfe: 0.064335 hartree
zpe.sumelectzpe: -231.822192 hartree
zpe.sumelectthermal: -231.816395 hartree
zpe.sumelectthermalent: -231.815451 hartree
zpe.sumelectthermalfe: -231.851006 hartree
dipole: 0.8522 -3.6238 2.0522
dipole: 4.2508
quadrupole: -30.7169 -41.8585 -35.7298
quadrupole: -1.5899 1.7820 3.5379
quadrupole: 5.3848 -5.7568 0.3719 -1.5899 1.7820 3.5379
hfenergy: -231.9153418 hartree
pointgroup: C01[X(C6H6)]
dipole: 0.3921774 -1.5926813 -0.3263469 debye
dipolederiv: -0.0445161 -0.0402891 0.1254054 -0.1034216 -0.203351 -0.2068613 -0.0588246 -0.15123 0.0182676 -0.367459 0.0786804 0.0956017 0.0240652 -0.1938515 0.0382432 0.072043 -0.1050489 -0.1689719 0.2071268 0.035306 -0.0040191 0.0301231 0.1568868 0.0067182 0.0085518 0.0179163 0.0938706 -0.0344253 -0.0007882 -0.0018813 -0.0875045 -0.1279015 -0.0549194 -0.0227163 -0.0567252 0.059806 -0.0499826 -0.0262743 0.0441142 -0.0089924 0.0703697 -0.0340682 0.106651 -0.0119708 -0.0531899 -0.0143577 -0.0081897 -0.0355176 0.0401327 0.0175425 0.0812849 -0.0887047 0.0574449 -0.0123051 0.1615656 0.0903048 0.0101863 0.1102055 0.0201062 0.0499842 0.0801498 0.1013371 -0.1687803 0.1170518 0.0574893 -0.4020322 0.0593959 -0.2637217 0.3262743 -0.1237074 0.1182871 0.128926 -0.0277273 -0.1587502 0.0763547 0.0156919 0.2306915 -0.114202 -0.0554946 0.1347692 -0.1894408 0.1160975 0.0141976 0.0510041 -0.0283668 0.2310627 0.0010697 -0.0046124 0.0409924 0.1330249 0.0169398 -0.0282419 0.0111824 0.0082274 0.017722 -0.0606314 0.0626241 -0.1261557 0.068697 -0.0803136 -0.0134446 0.0296015 -0.0595565 0.0444444 -0.032892 0.0240403 -0.0196162 0.0900958 unknown
polarizability: 72.6785142|-3.7918803|57.4041421|-5.4693217|5.1871828|51.5770492 unknown
InChI: InChI=1/6C.6H
charge 0 multiplicity 1
12 atoms
C  -0.62713622 0.03976643 0.18137037
C  0.22488943 1.33950254 0.51629031
C  -2.01668542 -0.43710748 -0.01776354
H  -2.05448765 -1.48922739 -0.3100702
H  -2.59208872 -0.31321739 0.90102882
H  -2.49999998 0.15613489 -0.79543705
C  1.64305327 -0.50194603 -0.64296721
C  0.56082415 -0.10132802 0.95930551
C  0.59498998 0.39740838 -0.53256586
H  1.1264372 -0.40716142 1.82090876
H  1.46992002 -1.50440219 -1.02236548
H  2.67316502 -0.16002142 -0.56092445
