program: Gaussian 16
title: Title Card Required
version: ES64L-G16RevC.01
frameworkgroup: C1[X(C6H6)]
method: RM062X
basis: 6-311G(d)
operation: Freq
keyword: #P
keyword: Geom=AllCheck
keyword: Guess=TCheck
keyword: SCRF=Check
keyword: Test
keyword: GenChk
keyword: RM062X/6-311G(d)
keyword: Freq
converged: YES YES YES YES
title: Mulliken charges:
elementType: C C C H H H C C C H H H
charge: -0.000439 -0.326789 -0.220130 0.194103 0.283328 0.231338 -0.485627 0.053561 -0.480390 0.252213 0.247985 0.250847
chargesum: 0.00000
title: Mulliken charges with hydrogens summed into heavy atoms:
elementType: C C C C C C
charge: -0.000439 -0.095451 -0.026027 0.017433 0.053561 0.050923
polarizability: 7.30175624e+01 -5.53262426e-01 5.75665759e+01 1.54414335e+00 9.06681928e-02 4.54146473e+01
1716.lowfreq: -133.2819 -6.2685 -0.0002 0.0003 0.0004 11.2891 16.0156 410.6740 540.6210
frequency: -133.2736 410.6721 540.6205 548.3238 609.5152 706.8896 768.6343 809.7679 896.0014 999.5391 1019.9361 1046.9493 1090.3141 1117.8976 1135.1172 1149.4793 1159.5013 1202.0108 1224.4082 1252.3604 1295.2957 1433.5945 1499.0828 1540.1152 3030.3189 3125.9466 3170.7135 3188.3599 3263.7499 3302.8388
redmass: 4.3258 3.4594 2.1080 3.7254 3.0584 1.7267 2.1552 2.2569 3.4715 1.1915 1.3508 2.3440 1.2417 1.2465 1.5050 1.4451 1.5902 2.9599 3.2443 2.4516 3.1801 1.6436 1.2213 1.2228 1.0829 1.0898 1.0570 1.0598 1.1178 1.1151
irintensity: 10.4108 7.6472 16.7178 15.4291 100.8393 1.4561 17.1222 1.3067 5.9694 23.5072 7.9356 8.5739 0.6168 22.0205 6.4362 6.5817 7.2866 3.3054 2.1128 13.5442 12.2286 9.5625 4.6954 0.5856 68.3288 28.0351 11.8242 9.7804 2.9402 1.0343
temp: 298.150 k
press: 1.00000 atm
elementType: 6 6 6 1 1 1 6 6 6 1 1 1
symmnumber: 1
zpe: 254433.5 jmol-1
zpe.correction: 0.096909 hartree
zpe.thermalcorrener: 0.101195 hartree
zpe.thermalcorrenthalpy: 0.102139 hartree
zpe.thermalcorrgfe: 0.069649 hartree
zpe.sumelectzpe: -231.829790 hartree
zpe.sumelectthermal: -231.825503 hartree
zpe.sumelectthermalent: -231.824559 hartree
zpe.sumelectthermalfe: -231.857050 hartree
dipole: 1.7886 -1.6435 -0.0959
dipole: 2.4309
quadrupole: -35.8324 -33.6869 -41.1073
quadrupole: 3.8801 -1.1547 0.1816
quadrupole: 1.0432 3.1886 -4.2318 3.8801 -1.1547 0.1816
hfenergy: -231.9266983 hartree
pointgroup: C01 [X(C6H6)]
dipole: 0.7036245 -0.6466809 -0.0377333 debye
dipolederiv: -0.0247492 0.0086652 -0.1883186 0.2977081 -0.1231563 -0.018846 -0.1776884 -0.017088 -0.5903642 -0.3390637 0.0672659 0.1464594 0.2177225 0.1062039 -0.0345985 0.3867732 -0.0424151 0.2609145 0.3767733 0.0423471 0.0996976 -0.0832648 -0.0202594 0.1639583 0.0335218 0.0293261 -0.2485217 -0.013287 -0.0934023 -0.0576923 -0.3007641 -0.0534837 -0.1491815 -0.0585685 -0.0280139 0.0979785 0.0736571 0.046819 0.0090477 0.0039025 0.0522949 -0.00083 0.0177614 0.0055034 0.1188503 0.0025025 0.0603972 -0.0182865 0.0365099 -0.150683 0.0486528 -0.1040702 -0.0117823 0.1240618 0.174702 -0.0504749 -0.0119785 -0.2178798 0.0908264 -0.0064304 0.0140431 0.0182369 0.2524595 -0.1489833 0.0037941 -0.0821669 0.0124045 -0.0690449 0.0316887 -0.2306275 0.0218143 -0.560574 -0.0309737 0.0400713 0.036558 0.0843929 0.1555854 -0.0415713 0.0944102 0.0086954 0.2062561 0.0510569 -0.0331285 0.0145031 0.0271064 -0.0581484 -0.0064625 0.0204728 0.0073203 0.11984 -0.0531404 -0.084132 0.0258428 -0.0204989 0.036332 0.0008904 0.0142559 0.0028416 0.1104184 -0.0684946 -0.0082222 0.0263342 -0.0573393 0.0335331 0.01273 -0.0102838 0.0055614 0.1086808 unknown
polarizability: 73.0179336|-0.5543391|57.5666939|1.5400702|0.0889512|45.4141582 unknown
InChI: InChI=1/6C.6H
charge 0 multiplicity 1
12 atoms
C  0.20937301 0.01542945 -0.73069895
C  -0.80775739 -0.61849153 0.300859
C  -1.93918501 0.1547134 -0.1139229
H  -2.62884568 -0.56770605 -0.58272976
H  -0.38946633 1.9568433 0.16279885
H  -0.79173897 -1.70838128 0.32736762
C  1.38484859 -0.74876211 -0.15566439
C  0.47544676 0.01444737 0.7827917
C  0.45939854 1.30290252 0.03668177
H  1.32303058 -1.82967842 -0.1451624
H  1.42354858 1.76662629 -0.13618699
H  2.37140634 -0.34040395 -0.34622956
