program: Gaussian 16
title: Title Card Required
version: ES64L-G16RevC.01
frameworkgroup: C1[X(C6H6)]
method: RM062X
basis: 6-311G(d)
operation: Freq
keyword: #P
keyword: Geom=AllCheck
keyword: Guess=TCheck
keyword: SCRF=Check
keyword: GenChk
keyword: RM062X/6-311G(d)
keyword: Freq
converged: YES YES NO YES
title: Mulliken charges:
elementType: C C C H H H C C C H H H
charge: 0.097952 -0.238223 -0.573822 0.233236 0.233776 0.237328 -0.490937 0.037618 -0.257457 0.235870 0.232343 0.252317
chargesum: 0.00000
title: Mulliken charges with hydrogens summed into heavy atoms:
elementType: C C C C C C
charge: 0.097952 -0.000896 -0.106810 -0.002751 0.037618 -0.025114
polarizability: 8.99877558e+01 5.57254479e-01 5.16509099e+01 -1.10448680e+00 2.07443190e+00 4.34693590e+01
1716.lowfreq: -16.5864 -4.4400 -0.0007 -0.0007 -0.0003 5.5586 133.1659 286.5372 368.8697
frequency: 133.1430 286.5353 368.8680 557.7820 659.4158 684.2458 728.1980 847.5156 857.1594 879.4313 969.2555 987.5698 1025.8817 1044.2419 1064.6303 1113.3421 1144.1590 1197.0930 1240.4153 1280.7327 1383.4847 1465.2324 1524.2329 1860.9937 3114.0491 3173.8637 3196.3823 3206.5648 3228.8854 3290.3197
redmass: 3.0249 2.6860 2.9029 4.5979 1.8251 2.3348 1.9550 1.3383 2.0447 2.5602 1.4426 1.3389 2.0000 1.6798 1.5118 1.2823 1.6568 1.6375 1.7110 2.8033 2.5342 1.3352 1.3355 9.0243 1.0543 1.0901 1.0588 1.1159 1.0960 1.1182
irintensity: 1.2004 5.6868 3.2600 16.0772 14.9295 7.0515 28.8628 64.9202 19.1472 11.7652 20.2509 20.2220 1.1371 5.5114 24.2272 13.5528 2.0819 10.9474 1.1691 0.3075 7.8020 2.0010 9.1339 241.8576 43.3811 13.9735 0.0237 12.1834 18.1439 2.1860
temp: 298.150 k
press: 1.00000 atm
elementType: 6 6 6 1 1 1 6 6 6 1 1 1
symmnumber: 1
zpe: 254287.9 jmol-1
zpe.correction: 0.096853 hartree
zpe.thermalcorrener: 0.102141 hartree
zpe.thermalcorrenthalpy: 0.103085 hartree
zpe.thermalcorrgfe: 0.068518 hartree
zpe.sumelectzpe: -231.894935 hartree
zpe.sumelectthermal: -231.889648 hartree
zpe.sumelectthermalent: -231.888704 hartree
zpe.sumelectthermalfe: -231.923270 hartree
dipole: 0.9810 -0.4709 0.2982
dipole: 1.1283
quadrupole: -33.5227 -37.1203 -35.6970
quadrupole: -1.1737 -0.1421 1.1640
quadrupole: 1.9240 -1.6737 -0.2503 -1.1737 -0.1421 1.1640
hfenergy: -231.9917883 hartree
pointgroup: C01 [X(C6H6)]
dipole: -0.4011517 -0.170562 -0.0839959 debye
dipolederiv: 1.0821072 0.0373872 0.625325 0.0057909 -0.0676347 -0.0779673 0.422483 -0.0123754 0.7836364 0.1646089 -0.0711914 -0.007945 0.1053582 0.0685886 0.0636345 -0.0724876 0.0719121 -0.22571 -0.3099126 0.022356 -0.3475545 0.0472699 -0.385157 0.0143787 -0.3227891 -0.0280186 -0.2556821 -0.0431729 -0.0137532 0.0054117 0.0279966 0.17128 0.0006647 0.0347372 0.0068166 0.0306052 0.0342355 -0.0094271 0.038851 -0.0362577 0.1751651 0.0257526 0.0037409 0.0039716 -0.0353098 -0.0383363 -0.0058011 -0.02703 0.071791 -0.0807961 0.0694478 -0.0145922 -0.0625886 0.1058098 0.4859523 0.0475717 0.0650069 -0.1493957 0.1969204 0.0321143 0.0657733 0.0661077 0.2601888 -0.7902365 0.0973002 -0.2205331 0.0729282 -0.0625398 -0.008696 -0.2637268 0.0208579 -0.614419 -0.4043656 -0.125553 -0.018739 -0.2075995 0.0533834 0.1479291 0.1813528 0.1219279 -0.1998549 -0.0686512 0.013995 -0.0089241 -0.0463743 -0.0793792 -0.0735882 -0.0981383 -0.0955929 -0.0040544 0.0197462 0.0067153 -0.123798 0.0862889 -0.0506132 -0.1387721 -0.0082935 -0.0457932 0.0536052 -0.131975 0.0004004 0.0199291 0.0222035 0.0607826 -0.0548981 0.0719403 -0.0472252 0.1011848 unknown
polarizability: 78.1841745|0.2819241|42.9449299|17.5548207|0.1192191|63.9789204 unknown
InChI: InChI=1/6C.6H
charge 0 multiplicity 1
12 atoms
C  -0.31368718 0.83845772 0.24566003
C  -1.93135541 1.45677224 -1.28520731
C  0.61000875 0.84438338 1.18867577
H  1.65727055 0.90916798 0.92460193
H  0.33702233 0.79259015 2.23409015
H  -2.10038143 2.52393515 -1.32730988
C  -2.90535741 0.34952568 -0.89697986
C  -1.70933251 0.67592336 -0.07522194
C  -0.63134297 0.72196209 -1.18597897
H  -2.89850197 -0.56264111 -1.49083115
H  -0.42057087 -0.18169832 -1.75058547
H  -3.87668487 0.62636167 -0.4962243
