program: Gaussian 16
title: Title Card Required
version: ES64L-G16RevC.01
frameworkgroup: CS[SG(C6H4),X(H2)]
method: RM062X
basis: 6-311G(d)
operation: Freq
keyword: #P
keyword: Geom=AllCheck
keyword: Guess=TCheck
keyword: SCRF=Check
keyword: GenChk
keyword: RM062X/6-311G(d)
keyword: Freq
converged: YES YES NO YES
title: Mulliken charges:
elementType: C C C C C H H H H C H H
charge: -0.600402 -0.202457 -0.199000 -0.128693 0.028946 0.268839 0.268839 0.221426 0.225537 -0.373348 0.237773 0.252539
chargesum: 0.00000
title: Mulliken charges with hydrogens summed into heavy atoms:
elementType: C C C C C C
charge: -0.062724 0.018970 0.026537 -0.128693 0.028946 0.116964
polarizability: 6.10123000e+01 4.24310291e+00 9.66138846e+01 -2.79076009e-09 -5.90972660e-09 3.49333632e+01
1716.lowfreq: -0.0006 -0.0003 0.0003 9.9376 10.4387 20.0252 99.4793 246.8606 359.1890
frequency: 99.4771 246.8506 359.1889 547.6163 600.0904 662.8715 790.0405 803.6518 839.9337 898.4050 936.0422 949.7790 978.5719 1013.1881 1033.2459 1108.6864 1143.1654 1275.9468 1297.0053 1350.1117 1401.6253 1445.7727 1663.7057 1701.4544 3044.8838 3065.6014 3167.0408 3220.2270 3243.5297 3271.8373
redmass: 2.2084 1.8854 2.4341 2.3292 1.3547 5.2968 1.4081 6.1449 1.6542 2.8371 2.4765 2.4364 1.2961 2.1925 1.3750 1.1146 1.1535 1.9043 2.8162 1.8266 1.1379 1.2421 5.8676 5.6393 1.0635 1.0945 1.0613 1.0871 1.1055 1.1162
irintensity: 22.2073 1.9270 2.0423 0.0248 10.6511 0.6568 0.0956 16.6538 45.9483 8.9367 1.9056 5.3511 0.0002 26.0726 33.8830 0.2561 0.0006 44.1173 22.4291 77.3735 10.3786 9.9629 4.4652 18.7980 3.6194 0.3420 9.5190 2.7415 16.1951 1.7745
temp: 298.150 k
press: 1.00000 atm
elementType: 6 6 6 6 6 1 1 1 1 6 1 1
symmnumber: 1
zpe: 252170.1 jmol-1
zpe.correction: 0.096047 hartree
zpe.thermalcorrener: 0.101512 hartree
zpe.thermalcorrenthalpy: 0.102457 hartree
zpe.thermalcorrgfe: 0.067302 hartree
zpe.sumelectzpe: -231.926181 hartree
zpe.sumelectthermal: -231.920715 hartree
zpe.sumelectthermalent: -231.919771 hartree
zpe.sumelectthermalfe: -231.954926 hartree
dipole: 2.1630 -0.0661 0.0000
dipole: 2.1640
quadrupole: -39.6766 -28.7684 -37.7129
quadrupole: 2.2327 0.0000 0.0000
quadrupole: -4.2906 6.6176 -2.3269 2.2327 0.0000 0.0000
hfenergy: -232.0222273 hartree
pointgroup: CS [SG(C6H4),X(H2)]
dipole: 0.0089397 0.8513271 0. debye
dipolederiv: -0.4217136 0.033694 0. -0.2092794 0.134498 0. 0. 0. 0.217838 -0.032458 -0.0196357 0. -0.0876962 0.0183808 0. 0. 0. -0.2014999 -0.2087489 0.0046522 0. -0.0675738 -0.0109468 0. 0. 0. -0.1691954 -0.55876 0.4214272 0. 0.9009305 -0.1796791 0. 0. 0. 0.1332376 0.621193 -0.2526906 0. -0.3841088 0.0067138 0. 0. 0. -0.4721241 0.1080685 0.0115702 -0.0254151 -0.0129808 0.0327982 0.0428197 -0.0818246 0.0576336 0.037572 0.1080685 0.0115702 0.0254151 -0.0129808 0.0327982 -0.0428197 0.0818246 -0.0576336 0.037572 -0.0152719 -0.0764187 0. -0.1114514 -0.0302935 0. 0. 0. 0.1449677 0.0429507 0.0352835 0. 0.0121158 -0.0965164 0. 0. 0. 0.1614377 0.2743863 -0.2099068 0. -0.0699803 0.1308768 0. 0. 0. -0.1556885 0.0327462 0.0360066 0. 0.0898403 -0.0388531 0. 0. 0. 0.1307432 0.0495392 0.0044479 0. -0.046835 0.0002231 0. 0. 0. 0.1351399 unknown
polarizability: 96.7697572|-3.5256651|60.8564274|0.|0.|34.9333632 unknown
InChI: InChI=1S/C6H6/c1-6-4-2-3-5-6/h2,4H,1,3H2
charge 0 multiplicity 1
12 atoms
C  1.40271913 -0.75409805 0.0000
C  1.36180406 0.76066295 0.0000
C  0.09120004 1.17129889 0.0000
C  -0.7889319 -0.01582716 0.0000
C  -0.01031184 -1.26291212 0.0000
H  1.92583492 -1.18573684 0.8647189
H  1.92583492 -1.18573684 -0.8647189
H  2.23508002 1.40268999 0.0000
H  -0.25220502 2.19914287 0.0000
C  -2.1328539 -0.06825323 0.0000
H  -2.75731395 0.82124374 0.0000
H  -2.61926085 -1.03675325 0.0000
