program: Gaussian 16
title: title
version: ES64L-G16RevC.01
frameworkgroup: C1[X(C6H6)]
method: RM062X
basis: 6-311G(d)
operation: Freq
keyword: #P
keyword: Geom=AllCheck
keyword: Guess=TCheck
keyword: SCRF=Check
keyword: GenChk
keyword: RM062X/6-311G(d)
keyword: Freq
converged: YES YES NO NO
title: Mulliken charges:
elementType: C C C C C H H H C H H H
charge: -0.460304 -0.246113 -0.070612 0.068379 -0.026548 0.224725 0.241925 0.243747 -0.742061 0.253825 0.257596 0.255441
chargesum: 0.00000
title: Mulliken charges with hydrogens summed into heavy atoms:
elementType: C C C C C C
charge: 0.006347 -0.002366 -0.070612 0.068379 -0.026548 0.024800
polarizability: 7.47558747e+01 -2.71463232e+00 5.53865627e+01 9.74789020e-01 -4.88707669e+00 5.03481403e+01
1716.lowfreq: -13.4640 -2.0462 -0.0008 -0.0006 -0.0006 11.5218 145.8498 182.4518 297.5055
frequency: 145.7716 182.4492 297.5053 384.8676 542.2876 598.2421 665.5379 808.3790 880.7503 927.6983 938.9868 1034.1198 1058.5957 1065.0993 1069.4115 1094.9284 1136.9776 1178.1973 1374.4655 1420.9761 1491.4276 1502.8630 1506.9125 1814.2333 3081.2321 3118.9640 3145.4283 3173.6301 3228.1155 3283.5734
redmass: 1.0582 2.8608 2.8782 4.1944 3.1951 4.6692 3.7320 3.5544 2.2595 1.7821 1.4832 1.8370 1.4714 1.3799 1.4081 1.8217 1.8695 3.3384 3.5444 1.2657 1.0408 1.2515 1.0894 11.1944 1.0360 1.0547 1.1017 1.1025 1.1150 1.0999
irintensity: 0.0031 10.4178 16.5323 46.1695 10.9951 51.5813 21.4104 11.1875 15.8577 28.0577 6.8149 11.1779 17.6458 8.3065 4.1144 1.3237 8.4960 1.1032 7.0649 1.8431 12.0167 2.4046 7.1060 19.5233 14.4893 23.6505 7.7163 5.2092 11.0349 0.6926
temp: 298.150 k
press: 1.00000 atm
elementType: 6 6 6 6 6 1 1 1 6 1 1 1
symmnumber: 1
zpe: 252122.7 jmol-1
zpe.correction: 0.096028 hartree
zpe.thermalcorrener: 0.101775 hartree
zpe.thermalcorrenthalpy: 0.102719 hartree
zpe.thermalcorrgfe: 0.067247 hartree
zpe.sumelectzpe: -231.877048 hartree
zpe.sumelectthermal: -231.871301 hartree
zpe.sumelectthermalent: -231.870357 hartree
zpe.sumelectthermalfe: -231.905829 hartree
dipole: 0.2814 0.5716 -0.0975
dipole: 0.6445
quadrupole: -29.9015 -36.4196 -39.1053
quadrupole: 0.9690 0.8602 1.9102
quadrupole: 5.2407 -1.2775 -3.9632 0.9690 0.8602 1.9102
hfenergy: -231.9730761 hartree
pointgroup: C01 [X(C6H6)]
dipole: 0.1109161 0.2247871 -0.0383204 debye
dipolederiv: -0.1324097 -0.0696531 0.1706354 -0.1660853 0.0679418 -0.0601736 0.1122603 -0.1161751 0.2399448 0.0113757 -0.0115632 -0.0091134 0.0643147 0.0320775 -0.1372703 0.1907049 -0.1184742 0.3557095 -0.1932194 -0.0234667 -0.1193297 0.1860832 -0.4386494 0.2213334 -0.2098948 0.3144566 -0.5539985 0.4976331 0.0862602 0.161487 -0.0730464 0.123623 -0.2804623 0.3488158 -0.3678186 0.3813021 -0.2919244 -0.1343376 -0.0534958 -0.1055106 -0.0339421 0.296564 -0.1740423 0.3940573 -0.6329181 0.0357917 0.0516806 -0.0836675 0.0166642 0.0434183 -0.0115636 0.0317344 -0.1070496 -0.0830663 0.0104899 0.1021446 -0.039179 0.1520269 0.0374119 -0.0121396 -0.0653332 0.0157914 0.0355927 0.0812608 0.0099254 -0.0226442 -0.0176298 0.0279225 -0.0411277 -0.1160473 -0.041489 0.1017526 0.017154 -0.0254165 -0.0240984 -0.0293362 0.0833073 0.0115229 -0.1065108 0.0219407 0.1036237 -0.0073324 0.0242008 0.010447 -0.051489 -0.0604518 -0.0469992 -0.0197297 -0.0491824 0.0761248 -0.0113736 -0.0138656 0.0271904 -0.0120057 0.0882366 -0.0144439 0.0814791 -0.0094189 -0.0521251 -0.0174457 0.0040911 -0.0182319 0.0360139 0.0291043 0.0747599 -0.0734365 0.0633619 0.0280579 unknown
polarizability: 74.7502354|-2.7270206|55.3899387|0.9867117|-4.8901256|50.3504036 unknown
InChI: InChI=1S/C6H6/c1-3-5-4-2-6(3,4)5/h4H,2H2,1H3
charge 0 multiplicity 1
12 atoms
C  -1.55010977 0.82999834 0.27220006
C  -1.40246812 -0.624699 -0.17158455
C  -0.0763325 -0.93001333 0.49730531
C  0.86032684 -0.21435391 -0.07188871
C  -0.4416162 0.32407733 -0.62541266
H  -1.35827597 1.03847321 1.32329505
H  -2.32695319 1.41790454 -0.20531057
H  -2.05344123 -1.37029306 -0.59777536
C  2.25723074 0.25004513 0.00499723
H  2.29828752 1.28819751 0.34163144
H  2.73533119 0.19455592 -0.97423731
H  2.81413171 -0.37007668 0.70672508
