program: Gaussian 16
title: Title Card Required
version: ES64L-G16RevC.01
frameworkgroup: C1[X(C6H6)]
method: RM062X
basis: 6-311G(d)
operation: Freq
keyword: #P
keyword: Geom=AllCheck
keyword: Guess=TCheck
keyword: SCRF=Check
keyword: GenChk
keyword: RM062X/6-311G(d)
keyword: Freq
converged: YES YES YES YES
title: Mulliken charges:
elementType: C C C C H C C H H H H H
charge: -0.188263 -0.188264 0.017146 -0.085662 0.235482 -0.472391 -0.472392 0.229716 0.229716 0.229716 0.229716 0.235481
chargesum: 0.00000
title: Mulliken charges with hydrogens summed into heavy atoms:
elementType: C C C C C C
charge: 0.047218 0.047218 0.017146 -0.085662 -0.012959 -0.012960
polarizability: 9.37691336e+01 2.46972300e-05 5.96884055e+01 1.40669167e-03 -3.17051512e-04 3.65339709e+01
1716.lowfreq: -6.3056 0.0005 0.0005 0.0007 10.2684 19.9468 165.1172 169.3934 269.0135
frequency: 165.1093 169.3893 269.0087 412.2265 518.1095 579.9170 675.5915 794.9989 910.2493 916.9491 917.3516 925.0363 1003.0392 1032.1140 1047.5484 1080.6914 1095.6803 1096.6390 1171.1300 1319.9840 1475.5148 1514.5761 1668.7423 1990.0651 3129.2577 3130.3144 3202.3899 3214.5295 3277.9478 3321.1947
redmass: 3.0350 3.4001 2.2508 3.2404 3.5909 4.2394 1.4611 1.0241 1.4326 2.2044 1.3222 1.1327 1.7572 3.3257 1.6164 1.7980 2.5322 1.3786 1.2649 3.5342 1.0891 1.3348 5.7104 10.0394 1.0493 1.0568 1.1185 1.1162 1.0871 1.1438
irintensity: 13.0039 2.6123 0.0000 6.7799 1.7457 5.4744 62.3679 0.3014 0.0000 10.0774 1.3806 0.0000 0.3245 15.8713 3.1194 0.7586 17.5843 1.4438 0.0000 50.8817 0.3232 0.4553 0.6749 245.8763 29.2009 53.4477 0.0000 33.9862 0.7293 2.0015
temp: 298.150 k
press: 1.00000 atm
elementType: 6 6 6 6 1 6 6 1 1 1 1 1
symmnumber: 1
zpe: 251367.1 jmol-1
zpe.correction: 0.095741 hartree
zpe.thermalcorrener: 0.101566 hartree
zpe.thermalcorrenthalpy: 0.102510 hartree
zpe.thermalcorrgfe: 0.066743 hartree
zpe.sumelectzpe: -231.924877 hartree
zpe.sumelectthermal: -231.919052 hartree
zpe.sumelectthermalent: -231.918107 hartree
zpe.sumelectthermalfe: -231.953874 hartree
dipole: 1.8928 -0.0001 0.0002
dipole: 1.8928
quadrupole: -30.7904 -32.9382 -36.5807
quadrupole: -0.0001 0.0003 0.0003
quadrupole: 2.6460 0.4982 -3.1442 -0.0001 0.0003 0.0003
hfenergy: -232.0206173 hartree
pointgroup: C01 [X(C6H6)]
dipole: -0.7445135 0.0124169 0.0106917 debye
dipolederiv: -0.493169 0.0628469 0.0055369 -0.1135454 -0.0322605 0.0019127 0.0049921 -0.0006604 -0.1202279 -0.4909837 -0.0475042 0.0052105 0.1289107 -0.0344839 -0.0016152 0.0058474 0.0008823 -0.1202393 1.5391985 -0.0274429 -0.0219935 -0.0274677 -0.1025081 0.0000299 -0.0220597 0.0000482 0.0161808 -0.8398084 0.0189549 0.0073951 0.0189582 0.291963 0.0016989 0.0073159 0.0016904 -0.330509 0.0184587 0.0894894 0.0027939 0.0302243 0.0761225 -0.0007946 0.0025708 -0.0016072 0.1929683 0.2094648 0.017274 0.0001202 0.0621058 -0.1064211 -0.0019064 0.0002709 -0.0012773 0.2130256 0.2065019 -0.0277511 0.0000261 -0.0726101 -0.1034159 0.0000469 -0.0000922 -0.0005807 0.2130338 -0.0452131 -0.0673844 -0.0269148 -0.0882527 -0.0142621 -0.0472918 -0.0826395 -0.0758864 -0.0631246 -0.0420934 -0.06532 0.0258705 -0.0873393 -0.0150602 0.0501522 0.0814857 0.0781254 -0.065466 -0.0369389 0.0659049 0.024554 0.0876192 -0.0194508 -0.050717 0.0793369 -0.0805392 -0.0662242 -0.0399385 0.0683685 -0.024903 0.0895816 -0.0202674 0.0484301 -0.0795256 0.0788724 -0.0623942 0.0145211 -0.0874359 0.002304 -0.0281847 0.0800447 0.0000541 0.0024974 0.0009326 0.1929765 unknown
polarizability: 93.7477121|-0.5682012|59.6976865|-0.8254251|0.0815049|36.5461113 unknown
InChI: InChI=1S/C6H6/c1-2-5(1)6-3-4-6/h1-2H,3-4H2
charge 0 multiplicity 1
12 atoms
C  -1.99539996 -0.49834053 0.01419588
C  -1.97340999 0.81542944 0.01807625
C  -0.69954769 0.137083 -0.00246012
C  0.60948499 0.11521352 -0.0213236
H  -2.52731381 1.74059683 0.02882281
C  1.84575092 -0.67137062 -0.04173761
C  1.87143692 0.86001224 -0.03726773
H  2.20790419 1.3494121 0.87190016
H  2.18143037 1.35520686 -0.95268796
H  2.13901664 -1.17134456 -0.96006516
H  2.16547357 -1.17709847 0.86453067
H  -2.57994315 -1.4045078 0.01985641
