program: Gaussian 09
title: 000051353
version: EM64L-G09RevD.01
frameworkgroup: C1[X(C7H12Cl4)]
method: RPBEPBE
basis: SDD
operation: Freq
keyword: #pfreq=noraman
keyword: PBEPBE/SDD
title: #p freq=noraman PBEPBE/SDD
converged: YES YES NO NO
title: Mulliken charges:
elementType: Cl Cl Cl Cl C C C C C C C H H H H H H H H H H H H
charge: -0.003945 -0.006343 0.002186 -0.001033 -0.361783 -0.338106 -0.361187 -0.321821 -0.303342 -0.584634 -0.583490 0.193491 0.200198 0.215923 0.220620 0.226674 0.196876 0.235087 0.237025 0.251808 0.229111 0.334368 0.322316
chargesum: 0.00000
title: Mulliken charges with hydrogens summed into heavy atoms:
elementType: Cl Cl Cl Cl C C C C C C C
charge: -0.003945 -0.006343 0.002186 -0.001033 0.031906 0.098437 0.062363 0.150292 0.177577 -0.250265 -0.261174
polarizability: 1.31485681e+02 -6.57037576e+00 1.13849251e+02 -6.27650225e+00 -2.99062452e-01 8.96463901e+01
1716.lowfreq: -4.4010 -0.0029 -0.0027 -0.0021 3.6504 7.7807 16.7443 29.5213 47.3387
frequency: 16.5306 29.4927 47.3289 71.7098 92.4679 111.4009 133.7528 151.9887 170.5124 228.3443 256.2391 280.2612 307.9764 324.4174 416.2329 432.9150 535.9231 597.8397 603.5360 656.5822 689.1992 733.1870 768.6407 843.5363 946.8314 947.6593 1009.9193 1041.9458 1065.9930 1075.5724 1103.8167 1111.2748 1131.1935 1194.4631 1201.3037 1210.2014 1223.9456 1248.5373 1266.4752 1287.2518 1292.4860 1303.3843 1307.4244 1344.7953 1357.6570 1369.1249 1435.3531 1446.6774 1466.8145 1473.5767 1486.9748 2957.2029 2974.8484 2975.6078 2992.3141 2993.5078 3003.9103 3026.7435 3039.7110 3060.5807 3068.1044 3124.7018 3126.1745
redmass: 13.9813 9.1551 8.2246 5.6215 1.7539 10.6553 3.7812 2.0949 4.1978 8.9619 10.0952 8.9661 2.6911 4.5751 3.6557 3.9083 5.0274 4.4516 4.5717 5.2948 6.6425 1.0810 1.1973 1.3407 2.4471 1.5876 3.8792 2.9682 2.1444 2.4027 2.8499 1.8690 1.3485 1.1083 1.1806 1.2679 1.3362 1.2844 1.2520 1.0835 1.1289 1.0955 1.2505 1.3919 1.5715 1.5459 1.0808 1.0811 1.0662 1.0906 1.0989 1.0591 1.0590 1.0627 1.0619 1.0602 1.0965 1.0998 1.0991 1.1036 1.1027 1.0899 1.0899
irintensity: 0.7646 0.4345 1.3619 1.0279 0.0799 1.1082 0.6564 0.2713 0.5341 6.5636 0.8622 2.3462 1.4151 2.6128 9.5021 5.2139 9.2423 40.9090 99.4914 15.9973 90.7320 21.8823 2.3237 37.3710 10.1043 5.0462 12.8708 6.4419 13.9890 0.7080 13.2724 14.3308 10.1691 6.7576 14.6957 39.8793 10.3470 11.8466 16.7623 3.3265 2.0180 7.4987 6.0750 11.1341 0.9784 4.8711 6.0270 5.4329 0.1039 0.2945 22.2017 17.1731 14.9980 17.6957 3.3555 42.3546 14.6652 2.6644 4.5237 8.7176 67.2090 11.0599 8.7983
temp: 298.150 k
press: 1.00000 atm
elementType: 17 17 17 17 6 6 6 6 6 6 6 1 1 1 1 1 1 1 1 1 1 1 1
symmnumber: 1
zpe: 467704.4 jmol-1
zpe.correction: 0.178139 hartree
zpe.thermalcorrener: 0.192082 hartree
zpe.thermalcorrenthalpy: 0.193026 hartree
zpe.thermalcorrgfe: 0.132995 hartree
zpe.sumelectzpe: -2113.292429 hartree
zpe.sumelectthermal: -2113.278487 hartree
zpe.sumelectthermalent: -2113.277543 hartree
zpe.sumelectthermalfe: -2113.337574 hartree
dipole: -1.2924 -2.3749 -1.5609
dipole: 3.1220
quadrupole: -120.2120 -97.1532 -92.7002
quadrupole: 1.2612 9.0125 0.6435
quadrupole: -16.8568 6.2019 10.6550 1.2612 9.0125 0.6435
hfenergy: -2113.4705687 hartree
pointgroup: C01 [X(C7H12Cl4)]
dipole: -0.5278565 1.025802 0.4216589 debye
dipolederiv: -0.2364991 -0.0945708 0.002152 -0.1621169 -0.6646972 0.189802 -0.0072966 0.1025173 -0.2198354 -0.2483703 0.0184326 -0.1119609 0.0121467 -0.2496182 0.1374764 -0.1828938 0.2218121 -0.6326349 -0.7063375 -0.2624095 -0.0608748 -0.246383 -0.3596801 -0.0477787 -0.1256886 -0.1054829 -0.169988 -0.2495181 0.0542859 0.0081699 0.0302167 -0.7249009 -0.0510419 0.0206647 0.0322659 -0.1468016 0.0056192 0.0018034 0.0064645 -0.037628 0.1651211 -0.0452991 -0.0308378 -0.0430753 0.1427312 -0.0369343 0.0002242 0.008688 0.0157358 0.0809464 -0.0623364 0.0266944 -0.062186 0.0756461 -0.0520648 -0.0128809 0.020059 0.0837432 0.0831795 -0.0567513 0.1063118 -0.0519444 0.1329478 -0.1608722 -0.0189385 -0.0184709 -0.1434502 -0.0558855 0.0154648 -0.1550794 0.0112009 -0.0526817 -0.2219919 -0.0118763 0.0446286 0.052726 -0.0854413 -0.0552969 0.0097261 -0.0546371 0.0086625 0.4801369 0.140742 0.1865667 0.2427419 0.9914438 -0.3583794 0.2959947 -0.354684 0.9187937 0.9981419 0.205983 0.0612631 0.1569845 1.1847536 0.0948873 0.0309205 0.10758 0.3181612 0.0331637 -0.0036767 0.0036464 -0.0035805 -0.1823851 -0.0039416 0.0035542 0.023909 0.0607041 0.0334715 0.0009772 -0.0112585 0.0026872 0.0564418 0.0440297 -0.016135 0.0177402 -0.1743475 0.0760959 0.0063587 -0.0102242 0.0036088 0.0655477 0.0381745 0.004814 0.0186384 -0.1162066 0.0760983 -0.0008785 0.0056976 0.012362 -0.1144059 0.0023662 0.0035484 0.0212339 0.0697317 0.0799521 -0.008078 0.0006637 -0.0243217 -0.1153871 0.0028931 -0.0003644 0.0215506 0.0709352 0.0475347 -0.0012853 -0.0120254 -0.0016947 0.0647331 0.0451627 -0.0138666 0.0245379 -0.1677865 0.0348058 -0.0638582 -0.0066825 0.0284904 -0.1222508 -0.002302 -0.0042425 0.0193098 0.1001522 0.0344688 -0.002596 -0.0695269 -0.0083005 0.0958785 0.0367155 0.0225862 0.0190182 -0.1154309 0.062558 0.0027598 -0.0103992 -0.0057075 0.0954011 0.0410419 -0.0230882 0.0218135 -0.0893194 0.0446597 0.0517268 0.0032292 -0.015181 -0.1146451 0.0137405 0.023295 -0.0012886 0.0897282 -0.073858 0.0120672 0.013304 0.0082797 -0.0422465 0.0056645 0.0098332 0.0054364 -0.0424828 -0.0202603 -0.014312 -0.0531093 -0.0013588 -0.051903 0.0157083 0.0015497 0.0047342 -0.0606786 unknown
polarizability: 131.1025215|7.8906457|113.0867824|5.8553108|-4.4239695|90.7920175 unknown
InChI: InChI=1S/C7H12Cl4/c8-6(9)4-2-1-3-5-7(10)11/h6-7H,1-5H2
charge 0 multiplicity 1
23 atoms
Cl -4.213288 -1.619805 0.535559
Cl -4.286872 0.648387 -1.539167
Cl 5.275073 0.899759 0.132586
Cl 3.933459 -1.830189 -0.23698
C  -0.047449 0.588322 0.499025
C  -1.394863 0.046479 -0.02802
C  1.16369 -0.026725 -0.238481
C  -2.591256 0.678375 0.713126
C  2.502367 0.53473 0.295731
C  -3.97608 0.225473 0.266887
C  3.720938 0.022645 -0.459771
H  -0.024267 1.692928 0.391086
H  0.039599 0.376497 1.584906
H  -1.484225 0.256001 -1.111355
H  -1.429112 -1.05342 0.091065
H  1.15127 -1.127048 -0.123274
H  1.07642 0.182088 -1.324658
H  -2.561111 1.781355 0.6002
H  -2.516067 0.462794 1.798466
H  2.619231 0.300633 1.370192
H  2.503455 1.639354 0.202646
H  -4.799028 0.701024 0.815366
H  3.688317 0.184845 -1.545236
