program: Gaussian 16
title: title
version: ES64L-G16RevC.01
frameworkgroup: CS[SG(C4H2),X(C2H4)]
method: RM062X
basis: 6-311G(d)
operation: Freq
keyword: #P
keyword: Geom=AllCheck
keyword: Guess=TCheck
keyword: SCRF=Check
keyword: GenChk
keyword: RM062X/6-311G(d)
keyword: Freq
converged: YES YES NO YES
title: Mulliken charges:
elementType: C C H H H C C C H C H H
charge: -0.739513 -0.095709 0.269469 0.244159 0.244159 -0.153746 -0.123039 -0.178479 0.229087 -0.153746 0.228270 0.229087
chargesum: 0.00000
title: Mulliken charges with hydrogens summed into heavy atoms:
elementType: C C C C C C
charge: 0.018275 -0.095709 0.075342 -0.123039 0.049791 0.075342
polarizability: 5.52811421e+01 -6.36451598e-01 5.59220107e+01 2.56466079e-08 -1.20192016e-08 5.43629856e+01
1716.lowfreq: -13.3594 -0.0006 0.0004 0.0006 1.5998 16.3748 109.0564 276.6557 284.4126
frequency: 109.0493 276.6553 284.4110 486.8802 630.1139 660.3012 681.6936 878.2392 912.1952 964.2195 972.2240 975.5375 1017.4053 1021.0129 1087.0140 1122.4766 1215.3353 1229.6105 1332.9821 1345.9109 1420.2195 1502.8238 1514.9423 1529.0766 3086.4974 3155.9446 3172.7481 3211.7391 3260.2963 3261.8122
redmass: 1.0462 2.9200 2.4099 7.1777 3.1693 6.1994 6.4108 1.2108 1.2180 1.5393 1.2351 2.0432 2.3288 1.8621 1.4524 1.4438 3.0112 3.8852 3.5389 2.5985 1.2046 1.0730 1.0435 6.9074 1.0354 1.1033 1.1032 1.0953 1.0955 1.1026
irintensity: 0.1063 8.7678 0.4006 22.0736 6.5773 7.7753 6.2087 21.2242 20.3736 21.2907 0.6862 34.2553 10.7185 0.0005 1.1435 0.1489 0.0225 7.4867 3.8222 0.5275 0.3391 9.3843 10.5718 4.9624 22.0184 9.8074 3.7114 16.5803 6.3753 1.4849
temp: 298.150 k
press: 1.00000 atm
elementType: 6 6 1 1 1 6 6 6 1 6 1 1
symmnumber: 1
zpe: 253126.0 jmol-1
zpe.correction: 0.096411 hartree
zpe.thermalcorrener: 0.101901 hartree
zpe.thermalcorrenthalpy: 0.102845 hartree
zpe.thermalcorrgfe: 0.067903 hartree
zpe.sumelectzpe: -231.888413 hartree
zpe.sumelectthermal: -231.882924 hartree
zpe.sumelectthermalent: -231.881979 hartree
zpe.sumelectthermalfe: -231.916921 hartree
dipole: -3.6338 2.4447 0.0000
dipole: 4.3796
quadrupole: -41.0468 -36.7876 -31.9644
quadrupole: 2.7319 0.0000 0.0000
quadrupole: -4.4472 -0.1880 4.6352 2.7319 0.0000 0.0000
hfenergy: -231.9848241 hartree
pointgroup: CS [SG(C4H2),X(C2H4)]
dipole: -1.4296254 0.9618236 0. debye
dipolederiv: 0.0423163 0.0006232 0. 0.0018514 0.177253 0. 0. 0. 0.0542383 -0.3255576 0.1109929 0. -0.0602255 -0.0034076 0. 0. 0. -0.2765228 -0.0337729 -0.0687121 0. -0.0188167 -0.0020843 0. 0. 0. 0.084097 0.0472862 0.0440851 0.0740895 0.0057322 -0.0291031 -0.0218422 0.0711527 -0.0711244 -0.0341334 0.0472862 0.0440851 -0.0740895 0.0057322 -0.0291031 0.0218422 -0.0711527 0.0711244 -0.0341334 0.125113 0.0052152 0.161293 0.1239388 -0.1365287 -0.0660979 0.0862894 0.0811111 0.0562166 -0.0573587 -0.0663012 0. -0.2932398 -0.242269 0. 0. 0. -0.0376232 -0.0355336 -0.1112784 0. 0.0195982 -0.1078249 0. 0. 0. 0.0993404 0.0973589 -0.0016329 0.0109237 -0.004879 0.1531483 -0.1080475 0.0168794 -0.0176244 -0.037614 0.125113 0.0052152 -0.161293 0.1239388 -0.1365287 0.0660979 -0.0862894 -0.0811111 0.0562166 -0.1296097 0.0393407 0. 0.1012484 0.2032999 0. 0. 0. 0.1075318 0.0973589 -0.0016329 -0.0109237 -0.004879 0.1531482 0.1080475 -0.0168795 0.0176244 -0.037614 unknown
polarizability: 55.2811232|-0.636442|55.9220297|0.|0.|54.3629856 unknown
InChI: InChI=1S/C6H6/c1-6-2-3(6)5(6)4(2)6/h2-4H,1H3
charge 0 multiplicity 1
12 atoms
C  0.04706857 1.87103704 0.0000
C  0.04404526 0.37979222 0.0000
H  1.0740598 2.23348488 0.0000
H  -0.4595392 2.26089091 0.8839379
H  -0.4595392 2.26089091 -0.8839379
C  0.04702908 -0.77538284 1.00686755
C  1.14648387 -0.82049083 0.0000
C  -1.02776686 -0.71953561 0.0000
H  0.04040945 -0.59332682 2.07254906
C  0.04702908 -0.77538284 -1.00686755
H  -2.09414728 -0.52460921 0.0000
H  0.04040945 -0.59332682 -2.07254906
