program: Gaussian 16
title: Title Card Required
version: ES64L-G16RevC.01
frameworkgroup: C1[X(C6H6)]
method: RM062X
basis: 6-311G(d)
operation: Freq
keyword: #P
keyword: Geom=AllCheck
keyword: Guess=TCheck
keyword: SCRF=Check
keyword: GenChk
keyword: RM062X/6-311G(d)
keyword: Freq
converged: YES YES YES YES
title: Mulliken charges:
elementType: C C C C H H C H C H H H
charge: -0.172978 0.052351 -0.293223 -0.132235 0.230658 0.238828 -0.172964 0.230653 -0.730543 0.243700 0.262054 0.243699
chargesum: 0.00000
title: Mulliken charges with hydrogens summed into heavy atoms:
elementType: C C C C C C
charge: 0.057680 0.052351 -0.054395 -0.132235 0.057688 0.018910
polarizability: 6.37823551e+01 5.16192242e-05 5.50153769e+01 -5.23742031e-01 2.94135092e-05 4.69272839e+01
1716.lowfreq: -3.0980 -0.0005 -0.0005 0.0006 10.2210 11.8512 187.5405 278.2012 293.4463
frequency: 187.5385 278.2008 293.4461 461.0493 646.7566 681.8672 685.6790 826.4875 847.6087 876.3962 966.1412 973.1722 984.0405 1061.6793 1090.4694 1125.9847 1195.4588 1221.4060 1306.0125 1327.6741 1417.4703 1499.5815 1515.7676 1522.5789 3080.6216 3155.8092 3156.5513 3252.1459 3254.0803 3334.0027
redmass: 1.0509 2.8701 2.6493 7.6295 5.1097 4.4958 5.0663 1.0678 1.2155 1.4210 1.8772 1.4656 1.5679 1.4560 1.6347 2.8854 2.7008 2.7450 3.0781 4.4237 1.2317 1.1007 1.0615 5.2694 1.0352 1.1028 1.1034 1.0971 1.0955 1.1018
irintensity: 0.1478 1.3335 1.0862 36.3746 1.1479 0.4725 4.1335 2.0695 15.1812 27.1180 7.0112 3.6358 10.7077 4.1531 9.6281 3.3623 0.0248 6.9520 3.5910 0.4124 1.6762 8.2094 11.1279 9.7658 16.4009 7.9557 11.6047 0.0131 6.8640 7.8150
temp: 298.150 k
press: 1.00000 atm
elementType: 6 6 6 6 1 1 6 1 6 1 1 1
symmnumber: 1
zpe: 252565.6 jmol-1
zpe.correction: 0.096197 hartree
zpe.thermalcorrener: 0.101586 hartree
zpe.thermalcorrenthalpy: 0.102530 hartree
zpe.thermalcorrgfe: 0.068048 hartree
zpe.sumelectzpe: -231.889888 hartree
zpe.sumelectthermal: -231.884500 hartree
zpe.sumelectthermalent: -231.883556 hartree
zpe.sumelectthermalfe: -231.918038 hartree
dipole: -4.3824 0.0001 1.7908
dipole: 4.7342
quadrupole: -44.6866 -32.0750 -35.1621
quadrupole: 0.0001 2.0876 0.0004
quadrupole: -7.3787 5.2329 2.1458 0.0001 2.0876 0.0004
hfenergy: -231.9860854 hartree
pointgroup: C01 [X(C6H6)]
dipole: 1.7243902 0.0002091 -0.7040736 debye
dipolederiv: 0.0852037 0.1911277 -0.030474 0.1056545 0.0566864 0.0905979 0.1000483 -0.0587064 -0.0742558 0.220908 -0.0000179 -0.0364538 -0.0000267 0.1133519 0.0000361 0.1566306 0.000055 -0.0142623 -0.4748174 -0.000038 0.1353478 0.000024 -0.3109137 -0.000027 -0.0767654 -0.0000253 -0.2070566 -0.1065686 0.0000243 -0.0615632 0.0000629 -0.017253 0.000039 -0.3333778 0.000026 -0.1793563 0.0962253 0.0215454 0.0020183 0.016773 -0.0417731 -0.0127843 -0.0131162 -0.1017037 0.1473698 0.0949279 -0.0000085 0.0332724 -0.0000111 0.0762117 0.0000273 0.0356699 -0.0000029 0.0672264 0.085221 -0.191091 -0.0305468 -0.1057002 0.0567327 -0.0905977 0.099995 0.0587001 -0.0742656 0.0962202 -0.0215374 0.0020112 -0.0167576 -0.0418344 0.0127267 -0.013129 0.1016717 0.1473907 -0.0730721 -0.0000041 0.0375168 -0.0000079 0.1050198 -0.0000161 0.0155226 -0.0000149 0.1581149 0.0028622 -0.0031581 -0.0114035 0.0617078 -0.0429921 -0.0736452 0.0529766 -0.0763841 0.0407587 -0.0299629 0.0000013 -0.0283215 0.0000088 0.0898059 0.0000229 -0.0774102 0.0000212 -0.0524687 0.0028527 0.0031563 -0.0114038 -0.0617275 -0.0430422 0.0736203 0.0529556 0.0763634 0.0408048 unknown
polarizability: 63.7826544|0.0002837|55.0153767|-0.5189034|0.0013749|46.9269848 unknown
InChI: InChI=1S/C6H6/c1-5-3-2-4(5)6(2,3)5/h3-4,6H,1H3
charge 0 multiplicity 1
12 atoms
C  -0.56650909 -1.00655635 0.29147083
C  0.50543292 -0.0000569 0.22447946
C  -0.60068213 0.00006988 -0.85941951
C  -1.67570725 -0.00015251 0.33306837
H  -0.55728832 -2.07309713 0.11073476
H  -0.58314454 0.00041607 -1.93355782
C  -0.56657996 1.00631574 0.29187223
H  -0.55744219 2.07290807 0.11141319
C  1.98797293 0.00000736 0.03611529
H  2.30959474 -0.88672061 -0.51274332
H  2.48758086 -0.00013614 1.00580095
H  2.30957102 0.88691353 -0.51246941
