program: Gaussian 16
title: Title Card Required
version: ES64L-G16RevC.01
frameworkgroup: C1[X(C6H6)]
method: RM062X
basis: 6-311G(d)
operation: Freq
keyword: #P
keyword: Geom=AllCheck
keyword: Guess=TCheck
keyword: SCRF=Check
keyword: GenChk
keyword: RM062X/6-311G(d)
keyword: Freq
converged: YES YES YES YES
title: Mulliken charges:
elementType: C C C C H H C H C H H H
charge: -0.252295 0.004847 -0.231122 -0.233216 0.235434 0.234811 0.009449 0.225519 -0.731488 0.235995 0.251121 0.250946
chargesum: 0.00000
title: Mulliken charges with hydrogens summed into heavy atoms:
elementType: C C C C C C
charge: -0.016861 0.004847 0.003689 -0.007697 0.009449 0.006573
polarizability: 7.91870488e+01 -1.72075808e+00 6.90103141e+01 -3.52807495e-01 2.19903171e+00 3.63068325e+01
1716.lowfreq: -7.3130 0.0003 0.0007 0.0007 6.8856 11.2266 89.3107 226.1432 299.8465
frequency: 89.2663 226.1425 299.8449 350.1299 469.3202 601.5737 631.5723 719.2376 789.8758 860.8347 929.2642 965.2337 1047.9995 1070.1337 1109.3727 1149.4119 1240.8265 1295.5687 1369.6324 1429.2364 1502.1864 1509.3372 1521.1012 1627.5682 3075.7230 3135.4175 3164.0551 3168.4986 3238.2724 3305.4384
redmass: 1.0715 3.4537 2.2891 2.3441 3.6638 4.5714 1.9221 3.0549 2.4080 1.5663 1.8158 1.7685 1.4365 1.4620 1.1989 2.9968 1.4193 4.0737 2.4485 1.2488 1.0815 2.6496 1.2541 7.6764 1.0365 1.1019 1.1022 1.0883 1.0932 1.1007
irintensity: 0.0611 6.0196 9.0371 5.0495 76.5465 0.3459 48.4353 44.5685 19.0047 12.8697 10.0590 10.7856 3.4496 5.1240 3.8284 28.1095 11.1340 15.3330 12.1862 1.2199 8.1799 7.5764 20.1198 0.9797 29.9600 14.0351 8.4221 5.5694 6.1009 0.1539
temp: 298.150 k
press: 1.00000 atm
elementType: 6 6 6 6 1 1 6 1 6 1 1 1
symmnumber: 1
zpe: 250570.3 jmol-1
zpe.correction: 0.095437 hartree
zpe.thermalcorrener: 0.101378 hartree
zpe.thermalcorrenthalpy: 0.102322 hartree
zpe.thermalcorrgfe: 0.066320 hartree
zpe.sumelectzpe: -231.920692 hartree
zpe.sumelectthermal: -231.914751 hartree
zpe.sumelectthermalent: -231.913807 hartree
zpe.sumelectthermalfe: -231.949810 hartree
dipole: -0.3320 -0.7130 0.0015
dipole: 0.7865
quadrupole: -31.5744 -34.0878 -39.6056
quadrupole: 0.4294 -0.0599 -2.3417
quadrupole: 3.5148 1.0015 -4.5163 0.4294 -0.0599 -2.3417
hfenergy: -232.0161294 hartree
pointgroup: C01 [X(C6H6)]
dipole: 0.1200602 0.2003299 0.2029722 debye
dipolederiv: -0.243749 -0.1100265 0.0714287 -0.0896047 0.4362401 0.2215046 0.0383001 0.2409463 -0.1167202 0.1345079 0.3676896 0.1824725 0.3938815 -0.705238 -0.1766664 0.1366435 -0.0371885 0.0694333 -0.2602661 0.2990854 -0.0004108 -0.100853 -0.3710645 -0.0455638 0.0218342 0.0364192 0.1316947 0.0166495 -0.3901405 -0.2222473 0.083139 -0.1831384 0.174089 -0.0547254 -0.1538662 -0.1757054 0.0715154 -0.0233616 -0.0783316 0.0031681 0.0897262 -0.0731528 -0.0983806 -0.024764 0.1396704 0.0991626 -0.0196356 -0.0633896 0.0215383 0.1166127 -0.0731682 -0.0855314 -0.0503469 -0.0124745 0.1565909 -0.1660341 0.0237838 -0.411547 0.3902714 0.0680326 0.0080954 0.0363693 -0.3066276 -0.0195297 0.0588426 0.0562141 0.034458 0.1260009 -0.0719748 0.082715 -0.0514277 0.1238726 0.1184983 -0.0030447 -0.0137095 0.0650894 0.0824951 -0.0070911 0.000474 0.0210464 0.1461189 -0.0091127 0.024619 0.0139559 -0.0276675 0.0491579 -0.0848606 -0.1008404 -0.0657589 -0.0689629 -0.0642108 -0.0300172 0.0396047 -0.0585562 0.0453057 0.0698324 0.0697524 0.0656904 -0.0189222 -0.0000564 -0.0079764 -0.009371 0.0869542 -0.0763693 -0.0009809 -0.0183368 -0.0171192 0.088623 unknown
polarizability: 78.931047|-3.5723983|56.0547893|2.0939811|15.9441155|49.5183591 unknown
InChI: InChI=1S/C6H6/c1-6-4-2-3-5-6/h2-4H,1H3
charge 0 multiplicity 1
12 atoms
C  -1.53856237 -0.36428774 -0.74429974
C  -0.19545231 -0.81089802 -0.55603219
C  -0.15573111 0.79723203 0.60376822
C  -1.54766145 0.61164474 0.20559011
H  -2.31113414 -0.80339691 -1.35264802
H  0.10347353 1.0988186 1.61768269
C  0.778732 0.06574008 -0.15521093
H  -2.38795038 1.05360095 0.72509889
C  2.25131466 -0.04581935 0.05461137
H  2.54572762 0.39612276 1.00854992
H  2.79483554 0.47906758 -0.73410142
H  2.5630974 -1.09011273 0.04075611
