program: Gaussian 16
title: Title Card Required
version: ES64L-G16RevC.01
frameworkgroup: C1[X(C6H6)]
method: RM062X
basis: 6-311G(d)
operation: Freq
keyword: #P
keyword: Geom=AllCheck
keyword: Guess=TCheck
keyword: SCRF=Check
keyword: GenChk
keyword: RM062X/6-311G(d)
keyword: Freq
converged: YES YES YES YES
title: Mulliken charges:
elementType: C C C C H H C H C H H H
charge: -0.191726 -0.024567 -0.296995 -0.367326 0.237779 0.248395 0.166005 0.181801 -0.758875 0.259748 0.279656 0.266106
chargesum: 0.00000
title: Mulliken charges with hydrogens summed into heavy atoms:
elementType: C C C C C C
charge: 0.046053 -0.024567 -0.048601 -0.185525 0.166005 0.046634
polarizability: 7.43983915e+01 -4.64889432e+00 6.65233194e+01 1.06989110e+00 -1.43441040e+00 4.82146618e+01
1716.lowfreq: -588.0335 -0.0003 0.0004 0.0005 4.8510 8.9591 16.9262 115.8078 224.9455
frequency: -588.0334 115.7973 224.9451 302.0595 497.6487 634.8705 659.0056 780.2326 833.4382 897.5519 955.6949 1013.3890 1017.4514 1055.0087 1072.9505 1127.1351 1151.4553 1222.6446 1266.1714 1338.4610 1406.9977 1485.6304 1498.9942 1680.9104 3007.6553 3077.5330 3153.1018 3186.0301 3195.6245 3231.2055
redmass: 4.1269 1.0643 2.9353 2.7524 7.3071 3.8271 4.2929 2.9798 1.9943 4.0309 1.3798 1.4820 1.5509 1.2576 1.2159 1.8254 1.5139 1.8547 1.8586 5.2888 1.2518 1.0581 1.0418 9.8651 1.0836 1.0405 1.0942 1.1041 1.0922 1.0934
irintensity: 341.8945 0.9274 10.6348 4.4630 9.3785 11.3944 1.7887 31.2991 37.1707 3.5249 32.5201 33.9266 5.1364 9.0509 27.0883 29.7855 16.1343 10.0581 6.3805 4.4515 4.3749 14.8815 8.7062 65.1225 81.4684 5.7905 2.7982 5.7701 19.7671 5.2000
temp: 298.150 k
press: 1.00000 atm
elementType: 6 6 6 6 1 1 6 1 6 1 1 1
symmnumber: 1
zpe: 245770.4 jmol-1
zpe.correction: 0.093609 hartree
zpe.thermalcorrener: 0.099063 hartree
zpe.thermalcorrenthalpy: 0.100007 hartree
zpe.thermalcorrgfe: 0.064987 hartree
zpe.sumelectzpe: -231.825220 hartree
zpe.sumelectthermal: -231.819766 hartree
zpe.sumelectthermalent: -231.818822 hartree
zpe.sumelectthermalfe: -231.853842 hartree
dipole: 1.1245 -0.3131 2.2834
dipole: 2.5645
quadrupole: -29.0428 -41.6444 -37.1288
quadrupole: 1.5695 -2.0066 2.5680
quadrupole: 6.8959 -5.7057 -1.1902 1.5695 -2.0066 2.5680
hfenergy: -231.9188294 hartree
pointgroup: C01 [X(C6H6)]
dipole: 0.2721928 -0.7506226 0.6168061 debye
dipolederiv: 0.2930483 0.2888935 0.0784568 0.1843501 0.06969 0.0176433 0.1523303 -0.1882527 -0.0690502 -0.3055444 -0.6996309 -0.3865711 -0.2038617 -0.6690333 -0.3773815 -0.1616082 -0.2034691 -0.3446184 -0.211895 -0.1783291 -0.1064097 0.1224777 -0.3378115 -0.2912663 -0.0284842 0.0785321 -0.0375507 -0.1511108 -0.016829 -0.0090516 0.004785 -0.5927769 0.0653853 -0.0314578 -0.0321156 -0.1840308 -0.0776385 -0.0404783 -0.0169675 -0.1658716 0.1045484 -0.0468138 0.0247678 0.0093755 0.1052544 0.0458523 -0.0334231 0.0702095 0.0135388 -0.0367284 0.1121894 0.0534143 0.0000248 0.0558555 0.5574114 0.1834688 0.139733 -0.0674486 1.1977847 0.6447168 -0.1058705 0.4496033 0.3054292 -0.0797576 0.4196943 0.2522785 0.0320059 0.1531988 -0.068839 0.1104549 -0.1071279 -0.0164061 -0.0828126 -0.0169724 -0.0640368 0.0648253 0.0123157 -0.0716933 -0.1257063 -0.0236398 0.0880771 -0.0383603 0.0447266 0.0074012 0.0553996 -0.0185674 0.0635053 0.0123897 0.0640023 0.0688145 0.0738572 0.0365023 0.0198062 -0.0287818 0.0207271 -0.0608843 0.0259941 -0.0579131 0.0638005 -0.02305 0.0123775 0.0151517 -0.0114186 0.0966529 0.013438 0.073776 0.0109803 -0.0355749 unknown
polarizability: 71.3715925|-6.9194128|63.7548788|-0.1790926|9.0353805|54.0099015 unknown
InChI: InChI=1S/C6H6/c1-3-5-4-2-6(3,4)5/h2,4,6H,1H3
charge 0 multiplicity 1
12 atoms
C  -1.34836886 0.33891268 -0.48956675
C  -0.37491242 -0.60652802 -0.89981711
C  -0.42822092 -0.09305842 0.70536968
C  -0.60952872 1.41407341 0.28298293
H  -2.40983645 0.11264404 -0.44066204
H  -0.81890521 -0.73728501 1.48192602
C  0.72621234 -0.26925154 -0.18280207
H  -1.24553793 1.92208811 1.02770984
C  2.18828457 -0.24435951 -0.05557979
H  2.54858545 -1.15903863 0.42338725
H  2.45680565 0.60339576 0.57467723
H  2.66505507 -0.13507496 -1.02788511
