program: Gaussian 16
title: Title Card Required
version: ES64L-G16RevC.01
frameworkgroup: C1[X(C6H6)]
method: RM062X
basis: 6-311G(d)
operation: Freq
keyword: #P
keyword: Geom=AllCheck
keyword: Guess=TCheck
keyword: SCRF=Check
keyword: GenChk
keyword: RM062X/6-311G(d)
keyword: Freq
converged: YES YES NO YES
title: Mulliken charges:
elementType: C C C H H C C C H H H H
charge: -0.626705 0.022316 0.010725 0.276210 0.267325 -0.133701 -0.314350 -0.447137 0.240736 0.236660 0.242190 0.225730
chargesum: 0.00000
title: Mulliken charges with hydrogens summed into heavy atoms:
elementType: C C C C C C
charge: -0.083169 0.022316 0.010725 0.108489 -0.088620 0.030259
polarizability: 9.83579695e+01 4.53260767e+00 6.53491805e+01 1.44201093e+00 4.53696235e-01 3.49703999e+01
1716.lowfreq: 0.0005 0.0007 0.0008 8.9185 10.2518 18.7531 97.6071 253.2717 339.5506
frequency: 97.5844 253.2688 339.5503 416.2114 660.1456 690.4138 767.1060 826.4983 891.1052 896.0003 945.2494 970.4827 981.1957 1024.8861 1090.4285 1117.7376 1167.2266 1262.7070 1299.3994 1394.4024 1413.1361 1469.3281 1548.2389 1737.6321 3046.6952 3112.6140 3170.0221 3202.5099 3226.1895 3257.9493
redmass: 2.5779 2.7288 2.3645 1.6830 4.9731 1.1391 2.9334 3.4375 2.8345 1.2814 2.4071 1.3862 1.8320 1.4559 1.7285 1.1955 1.5497 1.7616 2.5663 1.9775 1.0932 1.2913 4.6544 5.9412 1.0700 1.0906 1.0605 1.0891 1.1003 1.1173
irintensity: 27.8005 15.4163 1.4031 8.2194 1.4624 5.1395 7.0568 1.7408 19.6040 20.0673 4.1625 36.5695 6.7833 0.2208 21.0677 8.3829 34.7260 6.7797 22.3517 29.3060 19.8836 5.7952 87.1116 6.4025 2.8604 3.5204 4.9634 4.9121 19.6930 5.6509
temp: 298.150 k
press: 1.00000 atm
elementType: 6 6 6 1 1 6 6 6 1 1 1 1
symmnumber: 1
zpe: 252866.1 jmol-1
zpe.correction: 0.096312 hartree
zpe.thermalcorrener: 0.101827 hartree
zpe.thermalcorrenthalpy: 0.102771 hartree
zpe.thermalcorrgfe: 0.067510 hartree
zpe.sumelectzpe: -231.932406 hartree
zpe.sumelectthermal: -231.926891 hartree
zpe.sumelectthermalent: -231.925947 hartree
zpe.sumelectthermalfe: -231.961208 hartree
dipole: -3.1332 -1.7565 0.5013
dipole: 3.6267
quadrupole: -39.5457 -33.6424 -37.8086
quadrupole: -4.6677 1.4111 0.9064
quadrupole: -2.5468 3.3565 -0.8097 -4.6677 1.4111 0.9064
hfenergy: -232.0287179 hartree
pointgroup: C01 [X(C6H6)]
dipole: -1.4088568 0.1527056 -0.16661 debye
dipolederiv: 0.04959 -0.2338685 -0.0733965 -0.1962811 -0.2896038 0.0318493 -0.2169397 -0.1234672 0.2340358 -0.2793251 -0.16345 -0.0134287 -0.2306041 -0.0894441 -0.0060739 0.0107794 0.0667393 -0.0289979 -0.0122975 0.0741629 0.1868772 -0.5766329 0.1847572 -0.1232363 0.482187 -0.0633381 -0.5317564 0.0495615 -0.013788 0.037215 0.014178 0.0904355 -0.0163417 0.0203198 -0.0364276 0.0363244 0.0653536 -0.0324887 0.0054875 0.0364205 0.0462792 0.0526283 -0.0087438 0.106339 0.0234325 0.7011711 -0.0654951 -0.0104146 0.3042271 0.1584178 -0.0101179 -0.0201178 -0.0129446 0.0010705 -0.8045899 0.3293438 -0.0937119 0.7042693 -0.0761553 0.0055549 -0.2901948 0.0285703 0.0153631 0.1053725 0.0233212 -0.0421816 -0.0823776 0.1384537 -0.0154458 0.0119763 -0.0323466 -0.2645834 0.0504148 0.0126337 0.0079927 -0.0387303 -0.0530188 0.0234504 -0.003654 0.0246196 0.1517713 -0.0080501 0.0321157 0.0057246 0.0864558 -0.0120147 0.0031375 0.0307548 0.0020612 0.131038 0.021583 0.1015093 -0.0214663 0.0591722 -0.0248017 0.0137203 0.0395956 -0.000338 0.0923841 0.0612162 -0.0639963 0.0113026 -0.0800967 -0.0733052 0.0408749 -0.0559628 0.0405329 0.139918 unknown
polarizability: 96.6125859|7.7248654|66.2141262|-4.8865637|-4.6208776|35.8508378 unknown
InChI: InChI=1S/C6H6/c1-6-4-2-3-5-6/h2,4H,1,5H2
charge 0 multiplicity 1
12 atoms
C  0.55955825 -1.06974604 0.06872193
C  -0.7200428 -0.26149756 0.0273998
C  1.71372205 -0.10689861 0.07060589
H  0.68370272 -1.67746541 -0.83980798
H  0.60983043 -1.7761774 0.9016175
C  -0.27855966 1.10801513 -0.17010237
C  1.08141057 1.16863959 -0.21987053
C  -1.98148721 -0.66287758 0.19565867
H  -2.22893677 -1.71074373 0.32760163
H  -2.8042511 0.04429247 0.21658871
H  -0.96625287 1.94521463 -0.2537083
H  1.64091637 2.0836995 -0.37856396
