program: Gaussian 16
title: Title Card Required
version: ES64L-G16RevC.01
frameworkgroup: C1[X(C6H6)]
method: RM062X
basis: 6-311G(d)
operation: Freq
keyword: #P
keyword: Geom=AllCheck
keyword: Guess=TCheck
keyword: SCRF=Check
keyword: Test
keyword: GenChk
keyword: RM062X/6-311G(d)
keyword: Freq
converged: YES YES YES YES
title: Mulliken charges:
elementType: C C C H H C H C H C H H
charge: -0.477633 -0.346699 -0.069561 0.244341 0.240307 0.130679 0.222903 -0.136154 0.217558 -0.508509 0.222223 0.260544
chargesum: 0.00000
title: Mulliken charges with hydrogens summed into heavy atoms:
elementType: C C C C C C
charge: 0.007016 -0.123797 0.147997 0.130679 -0.136154 -0.025742
polarizability: 7.95343253e+01 -2.52732602e+00 5.89608013e+01 -3.90263211e+00 1.00058392e+00 4.81666917e+01
1716.lowfreq: -752.9869 -0.0008 -0.0005 -0.0003 9.9376 12.1553 19.3513 288.7677 426.5724
frequency: -752.9864 288.7668 426.5721 466.7184 613.9173 640.5973 801.9372 885.5112 923.4979 962.8012 989.4500 1018.6874 1025.9054 1048.9319 1096.0718 1110.5735 1158.1701 1232.1007 1262.9659 1308.3748 1487.4128 1498.8881 1517.3962 1659.0179 3056.1213 3060.6105 3087.9238 3157.6077 3211.4503 3272.7530
redmass: 2.7278 2.0616 3.0931 2.8034 2.2217 1.5541 4.7116 2.2691 2.1099 1.6368 1.6728 2.5474 1.5392 1.6348 1.3601 2.7503 1.2982 1.3104 1.5751 1.7111 1.1646 1.1844 3.9771 7.9922 1.0877 1.0688 1.0616 1.0982 1.1065 1.0951
irintensity: 107.6506 6.6745 6.0227 6.0481 26.5014 30.1496 16.2502 14.9495 15.1881 1.2092 4.3654 14.4004 0.4799 6.5103 21.9667 36.8357 4.6878 13.4908 11.5619 16.3062 4.2204 5.1368 26.1665 39.3389 50.0980 38.9830 44.4106 15.3439 8.0313 1.4461
temp: 298.150 k
press: 1.00000 atm
elementType: 6 6 6 1 1 6 1 6 1 6 1 1
symmnumber: 1
zpe: 252835.1 jmol-1
zpe.correction: 0.096300 hartree
zpe.thermalcorrener: 0.100881 hartree
zpe.thermalcorrenthalpy: 0.101825 hartree
zpe.thermalcorrgfe: 0.068790 hartree
zpe.sumelectzpe: -231.856052 hartree
zpe.sumelectthermal: -231.851471 hartree
zpe.sumelectthermalent: -231.850527 hartree
zpe.sumelectthermalfe: -231.883562 hartree
dipole: -0.5585 -0.0812 1.8218
dipole: 1.9072
quadrupole: -32.8412 -36.7902 -37.8748
quadrupole: 1.8868 0.3383 -1.8213
quadrupole: 2.9942 -0.9548 -2.0394 1.8868 0.3383 -1.8213
hfenergy: -231.9523517 hartree
pointgroup: C01 [X(C6H6)]
dipole: -0.2195507 -0.0320792 0.716813 debye
dipolederiv: 0.1624854 0.0044553 -0.0645801 0.2135612 -0.0039308 0.0146203 0.1252028 -0.0328412 0.1699001 -0.3195686 0.1162548 -0.03752 0.176834 -0.1608991 -0.0460611 -0.049351 0.1083192 -0.3007191 0.3259721 0.1458997 -0.1480398 -0.2392641 0.4120993 0.0129064 -0.335064 -0.1006502 0.523843 -0.0103066 -0.0088559 -0.0332168 -0.073345 0.0580377 -0.0377155 -0.1289485 -0.0528435 -0.0987041 -0.0522401 -0.0296981 0.0487613 -0.0627512 0.0973678 0.0235089 0.1082536 0.02091 -0.0080503 0.0735032 -0.2841106 0.0496337 -0.165272 0.2700147 0.0362061 -0.0548174 0.2361235 0.0795209 0.0603504 0.0173286 0.0113738 0.0473039 -0.0305484 -0.0653805 -0.0090965 -0.0573371 0.1849146 -0.430751 0.1609161 0.1563567 0.2357557 -0.941256 -0.1394186 0.6493008 -0.3829039 -0.7660035 0.0211512 0.001501 -0.0226593 -0.0499821 0.089898 0.1362659 -0.0285292 0.2037942 -0.0741429 0.264634 -0.0225816 0.0419503 -0.0124693 0.0141188 0.0074995 -0.1791995 0.0362879 0.4013528 -0.0357817 -0.0384453 -0.02159 -0.0500437 0.0710364 0.0422536 -0.1487075 0.0013864 -0.1289093 -0.0594482 -0.062664 0.0195303 -0.0203274 0.1240617 0.015315 0.0509565 0.0197547 0.0169977 unknown
polarizability: 79.5330749|-2.5233483|58.9597729|-3.9113232|1.0018312|48.1689705 unknown
InChI: InChI=1S/C6H6/c1-2-5-4-6(5)3-1/h2-3H,1,4H2
charge 0 multiplicity 1
12 atoms
C  -1.61372038 -0.20700366 -0.11421088
C  -0.82495163 1.09115262 0.08903174
C  -0.35634473 -1.03149405 0.24574203
H  -1.97355884 -0.38631903 -1.13355411
H  -2.42675596 -0.3571535 0.59499137
C  0.43913451 0.66879997 -0.15332825
H  -1.17144967 2.04384611 0.45795097
C  0.74124746 -0.71125417 -0.51119501
H  -0.32744552 -1.52633867 1.22681638
C  1.81277773 0.1409574 0.14019378
H  2.10085836 0.05590449 1.19017267
H  2.61020368 0.46491549 -0.5203467
