program: Gaussian 16
title: Title Card Required
version: ES64L-G16RevC.01
frameworkgroup: C1[X(C6H6)]
method: RM062X
basis: 6-311G(d)
operation: Freq
keyword: #P
keyword: Geom=AllCheck
keyword: Guess=TCheck
keyword: SCRF=Check
keyword: Test
keyword: GenChk
keyword: RM062X/6-311G(d)
keyword: Freq
converged: YES YES YES YES
title: Mulliken charges:
elementType: C C C H H C H C H C H H
charge: -0.440309 -0.306718 -0.261575 0.248251 0.257933 0.118496 0.231652 -0.117722 0.254520 -0.497836 0.231748 0.281561
chargesum: 0.00000
title: Mulliken charges with hydrogens summed into heavy atoms:
elementType: C C C C C C
charge: 0.065875 -0.075066 -0.007055 0.118496 -0.117722 0.015473
polarizability: 7.92719951e+01 1.65872031e+00 5.42124228e+01 1.49783100e+00 2.13220564e+00 4.56763100e+01
1716.lowfreq: -304.3283 -0.0003 -0.0002 0.0001 4.9709 7.7481 21.4846 264.5954 407.1457
frequency: -304.3283 264.5954 407.1457 502.2823 553.6458 724.8763 778.0051 820.6540 892.7356 918.6051 944.5401 973.9939 994.1680 1029.0790 1035.6739 1089.8544 1102.5258 1193.7354 1230.8383 1270.5816 1340.1227 1462.3086 1502.5831 1625.3752 3143.1386 3152.3389 3243.2798 3245.9709 3257.0199 3302.5173
redmass: 2.9577 2.5846 3.9924 3.0218 2.9913 1.8435 1.8199 1.5452 1.8057 1.4995 1.7552 1.8156 1.4945 1.3943 1.5639 1.9415 1.2712 1.8427 1.8867 3.4978 2.8549 1.2141 1.2621 5.3376 1.0586 1.0647 1.0976 1.1025 1.1021 1.1071
irintensity: 0.5643 9.5882 20.5660 2.6386 20.9162 26.2957 7.3221 8.0939 3.2856 43.0459 1.2401 3.8846 0.9034 4.4726 0.9224 1.6370 13.2961 3.6490 2.1658 7.3296 0.7321 4.2780 4.0264 54.4231 18.0790 8.2804 1.7548 2.1621 5.3523 3.9200
temp: 298.150 k
press: 1.00000 atm
elementType: 6 6 6 1 1 6 1 6 1 6 1 1
symmnumber: 1
zpe: 251228.9 jmol-1
zpe.correction: 0.095688 hartree
zpe.thermalcorrener: 0.100373 hartree
zpe.thermalcorrenthalpy: 0.101317 hartree
zpe.thermalcorrgfe: 0.068124 hartree
zpe.sumelectzpe: -231.862303 hartree
zpe.sumelectthermal: -231.857618 hartree
zpe.sumelectthermalent: -231.856674 hartree
zpe.sumelectthermalfe: -231.889867 hartree
dipole: -0.9866 2.4401 1.3131
dipole: 2.9413
quadrupole: -31.7301 -41.0495 -35.4342
quadrupole: 1.6539 0.1896 0.4976
quadrupole: 4.3411 -4.9782 0.6371 1.6539 0.1896 0.4976
hfenergy: -231.957991 hartree
pointgroup: C01 [X(C6H6)]
dipole: -0.3883639 0.9576175 0.520845 debye
dipolederiv: -0.0100313 -0.0354288 -0.0012033 0.0448614 0.0526582 0.0038153 0.0478807 0.0055224 0.1401309 -0.1997553 -0.0172335 0.0696619 -0.1619158 -0.135446 0.2097886 0.3059799 0.0781226 -0.101098 -0.2514087 0.0762609 -0.0049127 0.125968 -0.0628098 -0.1026426 0.0979111 0.0248978 -0.043567 0.0335918 0.0158887 0.0278664 -0.0538797 0.0549625 -0.0649104 -0.0717321 -0.0413353 -0.0560436 -0.0603218 0.0216067 0.0197208 0.0663099 0.1308338 -0.0445742 0.02908 -0.0476044 0.0621251 0.6995416 -0.1248802 -0.1682742 -0.2602561 -0.1087358 0.0106454 -0.3798695 -0.0379693 0.0711069 0.0094006 0.0050375 0.0069345 0.024978 -0.0424466 -0.0621777 0.0316387 -0.0891398 0.1048616 0.0128631 0.0577221 -0.1021971 0.340297 -0.0712822 -0.0086225 0.0631915 0.0681437 -0.3009875 -0.0280449 0.0079913 0.0331533 -0.0057062 0.1181822 0.0392824 0.0171625 0.0421698 -0.0003256 -0.2799643 0.0342781 0.1521779 -0.0551838 -0.0812234 0.2054755 -0.0875985 0.1571468 0.0116492 0.0119691 -0.0352065 -0.0157754 -0.0849374 0.0265202 -0.1204863 -0.0198185 -0.0775337 0.0290267 0.06216 -0.0060364 -0.0171523 0.0194646 0.1187868 -0.0655935 -0.0338258 -0.0824208 0.0831212 unknown
polarizability: 79.2724194|1.6734362|54.197558|1.4701672|2.1660533|45.6907504 unknown
InChI: InChI=1S/C6H6/c1-4-2-5-3-6(4)5/h5-6H,1,3H2
charge 0 multiplicity 1
12 atoms
C  -1.70225794 -0.02446357 -0.34813357
C  -0.58341339 0.90138948 0.05811979
C  -0.70755963 -0.53952338 0.61894443
H  -1.71335992 -0.42455076 -1.35843843
H  -2.66979102 0.23580297 0.06353954
C  0.6689381 0.30468584 -0.41548746
H  -0.7249969 1.84990821 0.55537709
C  0.52980691 -1.08175296 -0.17043432
H  -0.90117435 -0.75110657 1.66121584
C  1.9628088 0.22232876 0.03664721
H  2.33468727 0.81891188 0.8671585
H  2.66294607 -0.41028491 -0.48502662
