program: Gaussian 16
title: Title Card Required
version: ES64L-G16RevC.01
frameworkgroup: C1[X(C6H6)]
method: RM062X
basis: 6-311G(d)
operation: Freq
keyword: #P
keyword: Geom=AllCheck
keyword: Guess=TCheck
keyword: SCRF=Check
keyword: GenChk
keyword: RM062X/6-311G(d)
keyword: Freq
converged: YES YES YES YES
title: Mulliken charges:
elementType: C C C C C C H H H H H H
charge: -0.463936 -0.219201 0.023819 -0.079624 -0.546874 -0.180144 0.253447 0.273136 0.238108 0.233876 0.233881 0.233514
chargesum: 0.00000
title: Mulliken charges with hydrogens summed into heavy atoms:
elementType: C C C C C C
charge: 0.008047 0.014680 0.023819 -0.079624 -0.020292 0.053370
polarizability: 1.00920451e+02 -1.75727645e+00 6.88393773e+01 -2.76108614e+00 -2.16802929e+00 3.43660264e+01
1716.lowfreq: -11.5838 -7.5922 0.0003 0.0003 0.0004 15.1031 132.4187 342.5032 375.1509
frequency: 132.4160 342.5031 375.1506 444.8174 547.6329 660.6211 698.7823 775.7061 840.7604 904.0917 930.2610 950.0166 958.8291 995.0134 1138.6191 1187.7568 1237.1349 1264.6103 1287.2567 1425.5309 1456.5764 1466.1882 1572.0242 1719.9337 3069.5216 3117.3211 3172.8323 3198.3936 3205.2076 3260.4435
redmass: 2.4775 2.4131 2.3418 2.3358 2.6766 3.9446 1.0871 1.7678 2.6044 1.7430 1.3972 1.8334 1.9992 2.3182 1.1961 1.3866 2.1508 1.4078 1.8876 2.0008 1.4311 1.1392 7.9105 5.7004 1.0619 1.1007 1.0604 1.0913 1.0918 1.1170
irintensity: 5.0991 3.7817 23.4082 70.0407 149.7226 8.3927 10.8494 13.9379 18.1845 16.4500 38.6682 9.9996 8.6068 10.0782 11.9887 6.5380 30.3653 10.1809 4.8808 33.7193 33.9013 8.5733 50.9930 5.8090 7.9321 8.7565 1.9847 18.3546 18.4074 4.9303
temp: 298.150 k
press: 1.00000 atm
elementType: 6 6 6 6 6 6 1 1 1 1 1 1
symmnumber: 1
zpe: 253225.2 jmol-1
zpe.correction: 0.096448 hartree
zpe.thermalcorrener: 0.101843 hartree
zpe.thermalcorrenthalpy: 0.102787 hartree
zpe.thermalcorrgfe: 0.068005 hartree
zpe.sumelectzpe: -231.919207 hartree
zpe.sumelectthermal: -231.913812 hartree
zpe.sumelectthermalent: -231.912868 hartree
zpe.sumelectthermalfe: -231.947650 hartree
dipole: 1.9402 -1.9013 -0.1459
dipole: 2.7204
quadrupole: -37.0085 -34.3149 -37.7897
quadrupole: 4.5148 -0.8256 -0.4930
quadrupole: -0.6375 2.0561 -1.4187 4.5148 -0.8256 -0.4930
hfenergy: -232.0156554 hartree
pointgroup: C01 [X(C6H6)]
dipole: -0.3800216 -0.989828 0.1461681 debye
dipolederiv: -0.0446847 -0.0732814 0.0250855 -0.1420936 0.0680024 -0.0829722 0.027969 -0.1018229 -0.2612469 0.4246256 -0.0961217 -0.0541594 0.4206291 0.7194703 0.001662 -0.5061583 0.0167026 -0.0127803 0.1005216 0.0422994 0.105758 -0.1081104 -0.1198709 -0.0416904 0.0406746 -0.2500533 -0.0493196 -0.8767156 -0.2769752 0.0351588 -0.391039 -1.3339488 0.1324473 0.6192516 0.0174098 -0.2895468 -0.1498372 -0.1166371 0.0543693 0.0390749 0.0165338 0.065049 0.2666191 0.2878438 0.1514396 0.4636673 0.4251672 -0.215103 0.02242 0.6570735 -0.0917434 -0.4782578 0.0185306 0.0065156 0.061683 -0.0157521 0.011845 0.0641054 -0.0365325 -0.0594823 0.0211201 -0.1027318 0.0344251 0.0897162 0.009121 -0.010892 0.0202113 0.0582684 0.0222195 -0.0287343 0.0568253 -0.0369601 -0.0161647 0.0251442 -0.0328338 0.0746458 0.0202777 0.0368158 -0.0000906 0.0514999 0.146228 0.0529251 0.0307691 -0.0164747 -0.0308459 -0.0494292 0.0422302 -0.026441 0.0490847 0.1324938 0.002737 0.0893628 0.0327323 0.0384925 -0.0367695 -0.0039585 0.0614565 0.0512834 0.0998142 -0.1084737 -0.043096 0.064514 -0.0074901 0.0369248 -0.020577 0.0025911 -0.0945721 0.0789373 unknown
polarizability: 93.8850528|12.9359366|75.5943161|-5.2745437|-2.8322906|34.6464859 unknown
InChI: InChI=1S/C6H6/c1-6-4-2-3-5-6/h2,5H,1,4H2
charge 0 multiplicity 1
12 atoms
C  -1.86999621 -0.95577206 0.00314138
C  -0.42175129 1.11375572 0.00454843
C  -0.69142662 -0.33222317 0.01192738
C  0.91859383 1.35304967 -0.12339816
C  0.68968171 -0.97132047 0.26878733
C  1.58555734 0.17401841 -0.14495034
H  0.89414622 -1.86101807 -0.33345534
H  0.76031685 -1.26416252 1.32202244
H  -2.78374074 -0.42348272 -0.2366232
H  -1.95653402 -2.01384877 0.22643157
H  -1.18393091 1.83496866 0.28308025
H  2.53485085 -0.00189267 -0.64265173
