program: Gaussian 16
title: Title Card Required
version: ES64L-G16RevC.01
frameworkgroup: C1[X(C6H6)]
method: RM062X
basis: 6-311G(d)
operation: Freq
keyword: #P
keyword: Geom=AllCheck
keyword: Guess=TCheck
keyword: SCRF=Check
keyword: GenChk
keyword: RM062X/6-311G(d)
keyword: Freq
converged: YES YES YES YES
title: Mulliken charges:
elementType: C C C C C C H H H H H H
charge: -0.444058 -0.240827 0.012378 -0.004338 -0.517311 -0.229176 0.248001 0.256494 0.240879 0.224145 0.233268 0.220544
chargesum: 0.00000
title: Mulliken charges with hydrogens summed into heavy atoms:
elementType: C C C C C C
charge: 0.020966 -0.007559 0.012378 -0.004338 -0.012816 -0.008631
polarizability: 7.43546819e+01 2.55890672e+00 5.98874021e+01 1.59355519e+00 2.76626536e+00 4.60954984e+01
1716.lowfreq: -7.3247 -0.0002 0.0003 0.0008 9.6646 13.9057 212.4155 289.4898 343.7019
frequency: 212.4116 289.4889 343.7015 471.2923 557.8655 740.1339 804.2786 874.6172 940.8307 969.5996 988.8852 1015.3446 1030.9837 1070.2147 1087.6698 1126.4875 1171.2696 1224.1180 1274.2449 1311.9620 1440.8580 1488.9986 1541.3461 1726.0970 3078.2088 3090.0002 3138.8730 3185.6222 3192.2716 3207.2443
redmass: 3.2772 2.4354 5.1652 4.1081 3.3108 3.2020 1.2876 2.8590 1.7452 1.9171 1.5925 1.3912 1.4685 1.3720 1.4073 1.7003 1.3076 1.7905 1.6124 2.0460 2.3366 1.1039 1.6190 8.5871 1.0620 1.0549 1.1025 1.1101 1.1009 1.0947
irintensity: 5.6545 49.2978 28.3535 93.5980 0.3232 6.8062 14.4161 12.9049 15.8642 1.4923 9.7939 4.0931 0.5212 20.8210 2.5914 2.3127 3.1749 6.3715 2.1380 8.2166 12.9390 2.3573 3.9168 5.8324 47.7160 48.9581 9.8246 7.0052 39.5515 23.9988
temp: 298.150 k
press: 1.00000 atm
elementType: 6 6 6 6 6 6 1 1 1 1 1 1
symmnumber: 1
zpe: 254774.2 jmol-1
zpe.correction: 0.097038 hartree
zpe.thermalcorrener: 0.102224 hartree
zpe.thermalcorrenthalpy: 0.103168 hartree
zpe.thermalcorrgfe: 0.069056 hartree
zpe.sumelectzpe: -231.870607 hartree
zpe.sumelectthermal: -231.865422 hartree
zpe.sumelectthermalent: -231.864478 hartree
zpe.sumelectthermalfe: -231.898590 hartree
dipole: -0.0413 -0.7674 -0.1987
dipole: 0.7938
quadrupole: -32.6376 -37.2778 -36.8961
quadrupole: -0.8071 0.8637 -1.5515
quadrupole: 2.9662 -1.6740 -1.2922 -0.8071 0.8637 -1.5515
hfenergy: -231.9676457 hartree
pointgroup: C01 [X(C6H6)]
dipole: -0.0288289 0.3015804 0.0757822 debye
dipolederiv: 0.046473 -0.1938478 0.0178917 -0.2014713 -0.0188341 0.0705095 0.0846267 0.1160239 0.2321722 0.2295233 -0.0297918 -0.162836 0.0650421 0.4100588 0.1879557 -0.2879158 0.1547381 0.3011601 -0.3976433 -0.0116403 0.0900125 0.1019274 -0.4717207 -0.320375 0.2901006 -0.4012737 -0.3380444 -0.0980576 0.0960921 0.1132123 0.2666199 -0.7447382 -0.2089529 0.0047817 -0.1986895 -0.3036865 0.0156352 0.2489875 0.1303546 -0.0732456 0.2830443 0.1290229 0.0128487 0.1312714 0.3214784 0.3268513 -0.2382713 -0.2131659 -0.1965303 0.2790999 0.1693713 -0.0632531 0.175037 -0.1508525 -0.0252047 -0.0644659 -0.0845863 -0.1051269 0.0295178 -0.0423126 -0.1242805 -0.0910536 -0.0458807 0.0767796 -0.0302045 -0.0136859 -0.0713423 -0.0080839 0.0659298 -0.0035838 0.0916445 0.0025752 -0.0995891 0.1197908 0.0086592 0.1495858 0.094245 -0.004103 -0.002923 -0.0096765 0.0300284 0.0077567 0.065798 0.0304294 -0.0192107 0.0841939 -0.0674381 -0.0933552 0.0153022 -0.1487905 0.0083018 -0.0195553 0.0366223 -0.0044101 0.0100186 0.065552 0.1350887 0.0565621 -0.0103194 -0.0908262 0.0571086 0.0470921 0.088162 0.0531987 -0.0451597 0.047865 -0.0398859 0.1101596 unknown
polarizability: 74.5562773|-1.9980063|59.7442298|-1.5157137|2.5875953|46.0370753 unknown
InChI: InChI=1S/C6H6/c1-2-6-3-5(6)4(1)6/h1,5H,2-3H2
charge 0 multiplicity 1
12 atoms
C  -1.51544623 0.41690672 -0.50464108
C  -1.00900363 -0.68098657 0.44296515
C  -0.3222872 0.57200838 0.34626683
C  0.24406697 -1.03546932 -0.17446244
C  1.17083725 0.92158129 0.17694597
C  1.45059768 -0.46862478 -0.28030845
H  1.6823953 1.28527869 1.07187398
H  1.25238415 1.6730884 -0.60922171
H  -2.41212236 0.95486506 -0.20746464
H  -1.44007912 0.18890137 -1.56888465
H  -1.51275357 -1.24153394 1.22210666
H  2.36886176 -0.94418929 -0.6049896
