program: Gaussian 16
title: Title Card Required
version: ES64L-G16RevC.01
frameworkgroup: C1[X(C6H6)]
method: RM062X
basis: 6-311G(d)
operation: Freq
keyword: #P
keyword: Geom=AllCheck
keyword: Guess=TCheck
keyword: SCRF=Check
keyword: Test
keyword: GenChk
keyword: RM062X/6-311G(d)
keyword: Freq
converged: YES YES YES YES
title: Mulliken charges:
elementType: C C C C C H H C H H H H
charge: -0.422719 0.058807 -0.459192 -0.181201 -0.255695 0.213775 0.257603 -0.210545 0.279566 0.250443 0.219759 0.249401
chargesum: 0.00000
title: Mulliken charges with hydrogens summed into heavy atoms:
elementType: C C C C C C
charge: 0.048659 0.058807 0.070816 -0.181201 -0.035936 0.038856
polarizability: 6.82028177e+01 2.10700242e+00 5.90371806e+01 -3.01585708e+00 -2.43091749e+00 4.95037360e+01
1716.lowfreq: -368.6890 -8.1101 -6.6973 -0.0004 -0.0003 0.0003 10.9424 379.5335 434.0827
frequency: -368.6889 379.5333 434.0820 612.8034 689.4485 736.4783 811.5467 849.4424 865.9974 902.9627 922.3524 1002.3613 1010.9953 1024.7599 1054.3202 1067.5158 1119.6806 1173.4425 1190.9106 1243.9821 1336.5917 1414.8218 1511.6646 1576.4235 3068.1277 3158.9353 3164.1162 3195.8123 3222.8787 3262.2050
redmass: 4.7672 2.4326 2.4575 3.4497 2.0230 3.5656 2.0226 1.8996 1.3639 1.5593 2.1211 1.5369 1.4617 1.8795 1.6320 1.3323 1.5862 2.1457 2.2390 1.8415 2.7973 1.4635 1.1576 2.6557 1.0631 1.0560 1.1023 1.0905 1.0999 1.1189
irintensity: 14.4055 1.4450 7.2961 12.3522 80.8342 2.0036 5.1131 1.3628 2.5343 9.6060 7.0808 0.3053 42.9960 0.1604 6.0360 4.9462 1.5254 6.0911 3.8909 16.0624 0.6718 1.1816 0.1369 19.2471 56.8724 1.8321 11.8736 11.0729 1.3979 0.9488
temp: 298.150 k
press: 1.00000 atm
elementType: 6 6 6 6 6 1 1 6 1 1 1 1
symmnumber: 1
zpe: 251240.9 jmol-1
zpe.correction: 0.095693 hartree
zpe.thermalcorrener: 0.100068 hartree
zpe.thermalcorrenthalpy: 0.101012 hartree
zpe.thermalcorrgfe: 0.068467 hartree
zpe.sumelectzpe: -231.833620 hartree
zpe.sumelectthermal: -231.829245 hartree
zpe.sumelectthermalent: -231.828300 hartree
zpe.sumelectthermalfe: -231.860845 hartree
dipole: 1.8703 2.0789 -2.9950
dipole: 4.0975
quadrupole: -31.8291 -36.6952 -40.7883
quadrupole: -1.5527 0.3323 4.4590
quadrupole: 4.6084 -0.2577 -4.3508 -1.5527 0.3323 4.4590
hfenergy: -231.9293122 hartree
pointgroup: C01 [X(C6H6)]
dipole: 0.7361417 0.8182081 -1.1779 debye
dipolederiv: -0.1877874 -0.0230263 -0.1417205 -0.1639897 0.166318 -0.1522489 -0.2208533 -0.0681222 0.1946671 0.384228 -0.1476312 -0.1867763 -0.0901281 0.1396076 -0.1287369 -0.1307277 0.1428929 0.1552912 -0.0488808 -0.0524118 0.0440037 -0.0625234 -0.1240547 -0.1912481 0.170987 -0.1167456 -0.1525223 -0.3287314 -0.0341253 0.0368808 -0.1971376 -0.3139065 0.144641 0.1124992 0.0708182 -0.3339936 0.0145205 0.0781898 -0.0102918 0.1718874 -0.0948484 0.1284346 -0.1643017 0.1411701 -0.1658041 0.0425798 -0.0374774 0.0742268 0.0372218 -0.1321135 0.1104342 0.000211 0.145973 -0.0375132 0.0685924 0.0609441 0.0611425 0.0777194 0.0144892 0.0003387 0.1062237 -0.0450135 -0.0057638 0.0426634 0.2186686 0.1839255 0.2719514 0.2740093 0.0836666 0.217594 -0.2579106 -0.1158103 0.0362391 0.0058066 0.00202 0.0569705 0.034756 0.0586887 0.008661 0.0600463 0.1093015 0.0047998 -0.0329789 0.0185174 -0.0808151 -0.0098921 0.1045358 -0.0251004 0.0339667 0.1134943 -0.0514656 -0.0250509 -0.1009432 -0.0589511 0.0164263 -0.0465043 -0.0711982 -0.0432935 0.1241781 0.0232423 -0.0109073 0.0190152 0.0377943 0.0292088 -0.1120013 -0.0039948 -0.0637819 0.1144752 unknown
polarizability: 68.2044534|2.1069032|59.0382333|-3.0126659|-2.4266003|49.5010476 unknown
InChI: InChI=1S/C6H6/c1-6-2-3-4(6)5(3)6/h3-4H,1-2H2
charge 0 multiplicity 1
12 atoms
C  -0.81740262 1.12632902 -0.06739933
C  0.35414252 0.4044739 0.5354773
C  1.5839939 0.37122973 -0.09349605
C  -0.34025126 -0.91754744 0.88519781
C  -1.13924113 -0.3349438 -0.36259913
H  -0.63601475 1.83677806 -0.87984505
H  -1.48154365 1.53088636 0.69544549
C  0.22057886 -0.94217243 -0.47210725
H  2.31568438 -0.37150599 0.20339319
H  1.91380208 1.18108137 -0.73732406
H  -2.05117472 -0.74907205 -0.77812381
H  0.7661114 -1.67336172 -1.05285211
