program: Gaussian 16
title: Title Card Required
version: ES64L-G16RevC.01
frameworkgroup: C1[X(C6H6)]
method: RM062X
basis: 6-311G(d)
operation: Freq
keyword: #P
keyword: Geom=AllCheck
keyword: Guess=TCheck
keyword: SCRF=Check
keyword: GenChk
keyword: RM062X/6-311G(d)
keyword: Freq
converged: YES YES YES YES
title: Mulliken charges:
elementType: C C C C H C H C H H H H
charge: -0.201933 -0.110254 -0.270521 -0.194083 0.246583 -0.402953 0.233725 -0.240016 0.229973 0.236496 0.235546 0.237437
chargesum: 0.00000
title: Mulliken charges with hydrogens summed into heavy atoms:
elementType: C C C C C C
charge: 0.044650 -0.110254 -0.040548 0.039641 0.069089 -0.002579
polarizability: 6.63383372e+01 -5.23140485e+00 6.15010548e+01 2.32303607e+00 -2.66152612e+00 4.81283442e+01
1716.lowfreq: -393.2357 -0.0007 -0.0005 -0.0004 5.5655 9.5760 13.1982 379.9436 655.1940
frequency: -393.2353 379.9433 655.1940 704.9593 768.4601 800.3665 849.4750 880.7118 923.3618 939.1502 973.2824 990.7955 1031.1972 1071.8428 1086.2653 1119.8772 1151.3722 1183.0228 1201.4727 1298.7024 1310.3911 1411.2386 1474.4848 1516.2549 3046.3487 3117.3084 3201.0984 3241.0980 3242.5483 3271.5685
redmass: 4.6759 2.0267 3.9096 3.2173 1.9388 3.0341 1.4775 1.8067 1.3937 2.0980 1.9139 1.9084 1.6448 1.5779 1.6356 1.2684 1.7442 1.8620 1.6211 2.0154 2.0156 2.1513 3.9253 1.1285 1.0656 1.0977 1.0913 1.0945 1.0936 1.0996
irintensity: 13.0096 1.8101 2.3542 30.0101 25.7060 8.4725 6.2076 15.0371 6.9741 0.4501 11.1789 5.3632 7.6658 1.3752 26.7863 5.8308 7.4937 2.1459 5.4546 28.9306 3.7625 1.3282 5.3225 0.9364 52.0805 23.8778 4.1829 12.2894 2.9195 0.3373
temp: 298.150 k
press: 1.00000 atm
elementType: 6 6 6 6 1 6 1 6 1 1 1 1
symmnumber: 1
zpe: 256250.8 jmol-1
zpe.correction: 0.097601 hartree
zpe.thermalcorrener: 0.101674 hartree
zpe.thermalcorrenthalpy: 0.102618 hartree
zpe.thermalcorrgfe: 0.070559 hartree
zpe.sumelectzpe: -231.896784 hartree
zpe.sumelectthermal: -231.892711 hartree
zpe.sumelectthermalent: -231.891767 hartree
zpe.sumelectthermalfe: -231.923826 hartree
dipole: 1.9008 -2.0234 2.3217
dipole: 3.6190
quadrupole: -37.7728 -33.5185 -37.5446
quadrupole: 3.0806 -3.5428 1.4017
quadrupole: -1.4942 2.7601 -1.2660 3.0806 -3.5428 1.4017
hfenergy: -231.9943851 hartree
pointgroup: C01 [X(C6H6)]
dipole: -0.617722 1.0447313 0.7444945 debye
dipolederiv: 0.1977699 -0.0330655 -0.1434 0.0342039 0.0755688 0.1667763 -0.1148952 -0.0464566 -0.1227236 -0.3958307 0.3238516 0.0624526 0.3082862 -0.4396263 0.0031231 0.2342853 -0.1967552 -0.2037848 0.0658542 -0.2540626 0.0871632 -0.3386283 0.2136827 -0.2100359 -0.1519934 0.0426149 -0.0755939 0.0418715 0.0746939 0.1116852 0.0729638 -0.0518977 0.0239558 0.0632305 -0.0760045 -0.129951 0.0016645 -0.0842067 0.0043213 -0.0758948 0.0333081 0.0214201 -0.0314512 -0.0203942 0.1342386 0.0977258 0.0050843 0.0341469 0.0602706 -0.1832206 -0.0041534 0.0554363 0.0653498 0.2807396 0.0438481 0.0323235 0.0087661 0.0200201 -0.0931403 -0.0414295 -0.0531815 0.0575848 0.1596732 0.0436732 -0.0576437 -0.055403 -0.03454 0.2918741 0.0015511 0.0671659 0.1412842 -0.0532371 0.0361983 -0.0081983 -0.0947831 0.017193 -0.0096433 -0.0028932 -0.0348001 0.0092458 0.0287872 -0.0521056 0.0142935 -0.0776805 -0.0512491 0.1187435 0.0096975 -0.1447386 -0.0019452 -0.1164294 -0.1022675 0.0221546 0.061184 0.0366538 0.0930708 -0.0240208 0.1126463 -0.0236626 -0.0351233 0.0215983 -0.0352247 0.0015475 -0.0492793 -0.0487196 0.0560089 -0.0017044 0.0491386 0.1334045 unknown
polarizability: 64.271275|-5.9777196|64.1664727|-0.1832075|0.4591621|47.5299885 unknown
InChI: InChI=1S/C6H6/c1-2-4-5-3(1)6(4)5/h1,3-5H,2H2
charge 0 multiplicity 1
12 atoms
C  0.94493342 0.66438393 -0.41120346
C  0.96141003 -0.8244931 -0.50938832
C  0.6893715 -0.30395737 0.83961688
C  -0.3066661 1.18800025 -0.06389662
H  1.85706482 1.24741387 -0.43152312
C  -1.38430159 0.14101591 -0.18665479
H  -0.48484787 2.23605938 0.15997274
C  -0.41434442 -0.99888241 0.09827877
H  1.15422779 -0.15207438 1.80120064
H  -1.86733002 0.12070899 -1.17134239
H  -2.15100207 0.24952164 0.58370137
H  -0.73060605 -1.99509077 0.37519783
