program: Orca
programVersion: 5.0.3
elementType: C H C H C C C H H C H H C C H H H H H H H
charge: 1
multiplicity: 1
keywords: PBE0 cc-pVTZ EnGrad RIJCOSX verytightscf cc-pVTZ/C def2/J soscf
formula: C8H13
InChI: InChI=1/C8H13/c1-3-7-5-2-6-8(4-1)9-7/h3,6-8H,1-2,4-5H2
21 atoms
C  -1.994296 0.669128 0.105222
H  -2.185346 0.860704 1.165575
C  -1.8278 -0.933314 -0.13058
H  -2.64357 -1.435579 0.392365
C  -0.455836 -1.336003 0.393402
C  0.686976 -1.270725 -0.368466
C  1.997017 -0.668366 0.094032
H  2.192532 -0.869977 1.151718
H  2.849567 -1.011363 -0.494911
C  1.830081 0.932939 -0.12911
H  1.917319 1.155127 -1.197418
H  2.643468 1.435576 0.397287
C  0.455178 1.323709 0.40014
C  -0.691009 1.282039 -0.358593
H  0.541946 -1.247483 -1.452347
H  -1.917297 -1.1457 -1.200654
H  0.002499 -0.000942 0.113958
H  -0.553967 1.284081 -1.443559
H  -2.852067 1.011538 -0.476393
H  0.346666 1.336293 1.487629
H  -0.345871 -1.371248 1.480247
totalener: -312.01690969 hartree
nucrepener: 382.86013937 hartree
electener: -694.87704907 hartree
oneelecener: -1166.20040232 hartree
twoeener: 471.32335325 hartree
kineticenergy: 309.60475014 hartree
exchangeener: -34.146422145426 hartree
correlationener: -1.976859597711 hartree
xcener: -36.123281743137 hartree
chargesum: 1.0000000
charge: -0.194797 0.150279 -0.201633 0.159004 -0.052100 -0.032127 -0.194038 0.149752 0.159668 -0.201056 0.148300 0.158817 -0.052795 -0.032414 0.159271 0.148673 0.082549 0.160149 0.159727 0.161987 0.162786
charge: 0.108451 -0.001981 0.112728 0.002405 0.129404 0.147962 0.108483 -0.002083 0.003128 0.112725 -0.002708 0.002259 0.127735 0.149367 0.004026 -0.002623 -0.014511 0.003333 0.003193 0.004653 0.004054
qa: -0.1948 0.1503 -0.2016 0.1590 -0.0521 -0.0321 -0.1940 0.1498 0.1597 -0.2011 0.1483 0.1588 -0.0528 -0.0324 0.1593 0.1487 0.0825 0.1601 0.1597 0.1620 0.1628
va: 3.8758 0.9902 3.8875 0.9863 3.7910 3.7930 3.8756 0.9905 0.9856 3.8877 0.9912 0.9864 3.7927 3.7924 0.9948 0.9910 1.1471 0.9942 0.9856 0.9954 0.9949
energy: -312.016909693399
dipole: -0.00382 -0.00235 -0.00617 0.00164 -0.00349 -0.00184 -0.07127 0.05630 -0.01497
magnitude: 0.01629 au
magnitude: 0.04142 debye
