program: Orca
programVersion: 5.0.3
charge: 1
multiplicity: 1
keywords: DLPNO-CCSD(T1) tightPNO Extrapolate(3/4,def2) RIJK def2/JK verytightSCF miniprint nopop
formula: C8H13
InChI: InChI=1/C8H13/c1-3-7-5-2-6-8(4-1)9-7/h3,6-8H,1-2,4-5H2
21 atoms
C  -1.994296 0.669128 0.105222
H  -2.185346 0.860704 1.165575
C  -1.8278 -0.933314 -0.13058
H  -2.64357 -1.435579 0.392365
C  -0.455836 -1.336003 0.393402
C  0.686976 -1.270725 -0.368466
C  1.997017 -0.668366 0.094032
H  2.192532 -0.869977 1.151718
H  2.849567 -1.011363 -0.494911
C  1.830081 0.932939 -0.12911
H  1.917319 1.155127 -1.197418
H  2.643468 1.435576 0.397287
C  0.455178 1.323709 0.40014
C  -0.691009 1.282039 -0.358593
H  0.541946 -1.247483 -1.452347
H  -1.917297 -1.1457 -1.200654
H  0.002499 -0.000942 0.113958
H  -0.553967 1.284081 -1.443559
H  -2.852067 1.011538 -0.476393
H  0.346666 1.336293 1.487629
H  -0.345871 -1.371248 1.480247
e0: -310.240218718 hartree
corrType: DLPNO BASED
e0: -310.253798104 hartree
basis: def2-TZVPP def2-QZVPP
scfener: -310.240218718 -310.253798104
corrmethod: MDCI MDCI
correner: -1.473993044 -1.544281910
corrcbsextra: -1.596347698
energy: -311.852016209008
dipole: -0.00382 -0.00400 -0.00782 0.00164 -0.00220 -0.00055 -0.07127 0.03662 -0.03465
magnitude: 0.03553 au
magnitude: 0.09031 debye
