program: Orca
programVersion: 5.0.3
elementType: C H C H C C C H H C H H C C H H H H H H H
charge: 1
multiplicity: 1
keywords: b3lyp cc-pVTZ EnGrad D3BJ RIJCOSX verytightscf cc-pVTZ/C def2/J soscf
formula: C8H13
InChI: InChI=1/C8H13/c1-2-4-6-8-7-5-3-1/h1-2,7H,3-6,8H2
21 atoms
C  -1.989882 0.570377 0.098425
H  -2.166428 0.750751 1.164138
C  -1.856434 -0.968164 -0.174319
H  -2.659115 -1.515186 0.327632
C  -0.457667 -1.27734 0.335576
C  0.640117 -1.218003 -0.455802
C  1.932067 -0.688076 0.072655
H  2.081688 -0.945664 1.126391
H  2.800774 -1.037109 -0.495145
C  1.836258 0.864184 -0.087615
H  1.890204 1.127564 -1.150514
H  2.679537 1.354744 0.406856
C  0.503952 1.444671 0.511421
C  -0.653613 1.103219 -0.313295
H  0.528773 -1.28962 -1.538805
H  -1.923998 -1.164912 -1.249196
H  0.363283 1.170667 1.560233
H  -0.541197 1.324252 -1.379392
H  -2.800597 1.013871 -0.490465
H  0.61822 2.545558 0.456769
H  -0.326943 -1.282509 1.419113
totalener: -312.23228362 hartree
nucrepener: 381.07291857 hartree
electener: -693.30520219 hartree
oneelecener: -1163.14996582 hartree
twoeener: 469.84476363 hartree
kineticenergy: 309.97515779 hartree
exchangeener: -36.303127561810 hartree
correlationener: -2.304735548757 hartree
xcener: -38.607863110567 hartree
chargesum: 1.0000000
charge: -0.163879 0.148109 -0.167029 0.152241 -0.087701 -0.105776 -0.177634 0.134034 0.151927 -0.185908 0.130376 0.153791 -0.162671 0.038858 0.167662 0.138370 0.141277 0.199120 0.158509 0.180953 0.155371
charge: 0.092879 0.004589 0.095431 -0.001788 0.106590 0.086018 0.076906 -0.002197 0.005329 0.112378 -0.008256 -0.001393 0.074633 0.325727 -0.013647 -0.001039 0.001940 0.010615 0.007719 0.039334 -0.011768
qa: -0.1639 0.1481 -0.1670 0.1522 -0.0877 -0.1058 -0.1776 0.1340 0.1519 -0.1859 0.1304 0.1538 -0.1627 0.0389 0.1677 0.1384 0.1413 0.1991 0.1585 0.1810 0.1554
va: 3.8126 0.9885 3.8477 0.9817 3.7915 3.7997 3.8667 0.9920 0.9831 3.8294 0.9894 0.9798 3.8537 3.5609 0.9856 0.9919 0.9934 0.9739 0.9824 0.9739 0.9938
dispcorr: -0.036668300 hartree
energy: -312.268951919059
dipole: 0.50993 -0.86209 -0.35217 1.92134 -1.10031 0.82104 0.14750 -0.26997 -0.12246
magnitude: 0.90173 au
magnitude: 2.29202 debye
