program: Orca
programVersion: 5.0.3
elementType: C H C H C C C H H C H H C C H H H H H H H
charge: 1
multiplicity: 1
keywords: PBE0 def2-TZVP EnGrad RIJCOSX verytightscf def2/J soscf
formula: C8H13
InChI: InChI=1/C8H13/c1-2-4-6-8-7-5-3-1/h1-2,7H,3-6,8H2
21 atoms
C  -1.999609 0.735336 0.077719
H  -2.194599 0.86623 1.145702
C  -1.751206 -0.936823 -0.14645
H  -2.618446 -1.34586 0.377106
C  -0.427402 -1.365785 0.40508
C  0.695277 -1.284459 -0.366015
C  2.007372 -0.687337 0.068179
H  2.220265 -0.878257 1.125691
H  2.858882 -1.024814 -0.527183
C  1.799046 0.891043 -0.144949
H  1.856832 1.131535 -1.211725
H  2.610898 1.423481 0.355202
C  0.423292 1.26152 0.449486
C  -0.752267 1.318819 -0.375626
H  0.530153 -1.212441 -1.445584
H  -1.846309 -1.124723 -1.217463
H  0.105008 0.273201 0.902262
H  -0.622317 1.393872 -1.459255
H  -2.871547 0.987456 -0.526297
H  0.383795 1.835378 1.387576
H  -0.346784 -1.515815 1.483568
totalener: -312.01584609 hartree
nucrepener: 380.82114330 hartree
electener: -692.83698940 hartree
oneelecener: -1162.52675113 hartree
twoeener: 469.68976173 hartree
kineticenergy: 310.13472322 hartree
exchangeener: -34.160457323015 hartree
correlationener: -1.967432848959 hartree
xcener: -36.127890171974 hartree
chargesum: 1.0000000
charge: -0.226322 0.187104 -0.266727 0.194486 -0.119619 -0.100174 -0.214769 0.163477 0.170163 -0.306299 0.168743 0.175624 -0.053481 0.028881 0.143426 0.184900 0.082377 0.185086 0.193252 0.222183 0.187690
charge: -0.179720 0.166425 -0.158343 0.166969 -0.197641 -0.095680 -0.217689 0.155265 0.154778 -0.205369 0.150981 0.157846 -0.212613 0.063472 0.158346 0.157814 0.245411 0.170653 0.164795 0.194546 0.159755
qa: -0.2263 0.1871 -0.2667 0.1945 -0.1196 -0.1002 -0.2148 0.1635 0.1702 -0.3063 0.1687 0.1756 -0.0535 0.0289 0.1434 0.1849 0.0824 0.1851 0.1933 0.2222 0.1877
va: 3.8933 0.9636 3.9758 0.9571 3.7956 3.9842 3.8921 0.9698 0.9716 3.9948 0.9639 0.9686 3.6970 3.8309 0.9664 0.9605 1.0935 0.9553 0.9634 0.9494 0.9570
energy: -312.015846094194
dipole: 0.06172 -0.66569 -0.60396 0.75891 -0.02048 0.73843 0.36535 -0.40093 -0.03557
magnitude: 0.95463 au
magnitude: 2.42648 debye
