program: Orca
programVersion: 5.0.3
elementType: C H C H C C C H H C H H C C H H H H H H H
charge: 1
multiplicity: 1
keywords: m062x def2-TZVP EnGrad RIJCOSX verytightscf def2/J soscf
formula: C8H13
InChI: InChI=1/C8H13/c1-2-4-6-8-7-5-3-1/h1-2,7H,3-6,8H2
21 atoms
C  -1.995967 0.535077 0.119647
H  -2.172473 0.725128 1.181986
C  -1.939149 -0.991995 -0.172408
H  -2.674167 -1.57969 0.3806
C  -0.507723 -1.166117 0.289423
C  0.615254 -1.141092 -0.497458
C  1.909629 -0.658405 0.067557
H  2.01632 -0.951618 1.117353
H  2.769241 -1.043285 -0.488166
C  1.883066 0.90487 -0.0442
H  1.993525 1.1912 -1.096864
H  2.733336 1.332326 0.493927
C  0.550293 1.481117 0.495134
C  -0.565357 0.873116 -0.273511
H  0.532917 -1.3058 -1.571456
H  -2.045514 -1.195955 -1.242148
H  0.429373 1.33886 1.573688
H  -0.433015 0.937214 -1.356526
H  -2.733235 1.085574 -0.474388
H  0.544408 2.567662 0.304009
H  -0.359879 -1.117185 1.369706
totalener: -312.31137550 hartree
nucrepener: 384.62672897 hartree
electener: -696.93810447 hartree
oneelecener: -1169.92698829 hartree
twoeener: 472.98888382 hartree
kineticenergy: 310.39740596 hartree
xcener: -23.104916297546 hartree
chargesum: 1.0000000
charge: -0.278244 0.202545 -0.288603 0.201721 -0.080946 -0.059085 -0.332823 0.203038 0.203047 -0.303246 0.200856 0.200225 -0.296434 -0.034724 0.213496 0.199507 0.196684 0.226831 0.201591 0.220945 0.203619
charge: -0.203901 0.159247 -0.197304 0.155418 -0.063886 -0.052211 -0.216887 0.160066 0.163369 -0.213537 0.153271 0.156842 -0.231598 0.054314 0.166394 0.158230 0.159239 0.174240 0.159691 0.187208 0.171795
qa: -0.2782 0.2025 -0.2886 0.2017 -0.0809 -0.0591 -0.3328 0.2030 0.2030 -0.3032 0.2009 0.2002 -0.2964 -0.0347 0.2135 0.1995 0.1967 0.2268 0.2016 0.2209 0.2036
va: 3.7369 0.9544 3.7416 0.9627 3.6964 3.6348 3.7679 0.9469 0.9584 3.7003 0.9463 0.9564 3.7409 3.5317 0.9464 0.9541 0.9522 0.9329 0.9604 0.9465 0.9473
energy: -312.311375500528
dipole: 0.56306 -0.77215 -0.20909 1.85757 -1.59039 0.26719 0.17950 -0.32682 -0.14732
magnitude: 0.36988 au
magnitude: 0.94016 debye
