program: Orca
programVersion: 5.0.3
elementType: C H C H C C C H H C H H C C H H H H H H H
charge: 1
multiplicity: 1
keywords: DSD-PBEP86 def2-TZVP D3BJ RIJCOSX verytightscf def2-TZVP/C def2/J soscf noTRAH
formula: C8H13
InChI: InChI=1/C8H13/c1-2-4-6-8-7-5-3-1/h1-2,7H,3-6,8H2
21 atoms
C  -2.003255 0.719946 0.081453
H  -2.208405 0.87561 1.144444
C  -1.765461 -0.927415 -0.143356
H  -2.619477 -1.370913 0.373187
C  -0.430247 -1.354162 0.409795
C  0.698218 -1.284382 -0.363675
C  2.009389 -0.686922 0.071492
H  2.223102 -0.879851 1.128084
H  2.859268 -1.020539 -0.527638
C  1.802615 0.89951 -0.143466
H  1.861909 1.132933 -1.21166
H  2.617423 1.425459 0.357786
C  0.425769 1.275633 0.43438
C  -0.739211 1.318866 -0.368471
H  0.53067 -1.206957 -1.442581
H  -1.852427 -1.128192 -1.213857
H  0.06392 0.172139 0.683857
H  -0.595897 1.326173 -1.453431
H  -2.867911 0.994388 -0.523968
H  0.361388 1.659858 1.459495
H  -0.34752 -1.516113 1.48674
totalener: -311.06950845 hartree
nucrepener: 381.52874039 hartree
electener: -692.59824884 hartree
oneelecener: -1163.20550155 hartree
twoeener: 470.60725271 hartree
kineticenergy: 309.95112645 hartree
exchangeener: -13.661352598179 hartree
correlationener: -0.925642641917 hartree
xcener: -14.586995240096 hartree
chargesum: 1.0000000
charge: -0.215517 0.175454 -0.286404 0.188569 -0.082506 -0.105889 -0.196993 0.159301 0.172035 -0.320753 0.168044 0.177986 -0.012747 0.018663 0.147604 0.177269 0.045831 0.187343 0.189010 0.222904 0.190797
charge: -0.182389 0.156817 -0.170436 0.157191 -0.197699 -0.084189 -0.205161 0.149613 0.150074 -0.195998 0.145850 0.151671 -0.200194 0.075920 0.155447 0.150456 0.278095 0.169709 0.157687 0.179929 0.157609
qa: -0.2155 0.1755 -0.2864 0.1886 -0.0825 -0.1059 -0.1970 0.1593 0.1720 -0.3208 0.1680 0.1780 -0.0127 0.0187 0.1476 0.1773 0.0458 0.1873 0.1890 0.2229 0.1908
va: 3.8297 0.9700 3.9678 0.9613 3.6476 3.9347 3.8362 0.9726 0.9701 3.9767 0.9639 0.9700 3.5288 3.7915 0.9668 0.9637 1.1239 0.9529 0.9643 0.9510 0.9609
total: -311.753637134 hartree
dispcorr: -0.012089011 hartree
energy: -311.765726144595
dipole: 0.02443 -0.47905 -0.45463 0.43529 0.22782 0.66311 0.24434 -0.33351 -0.08917
magnitude: 0.80892 au
magnitude: 2.05611 debye
