program: Orca
programVersion: 5.0.3
elementType: C H C H C C C H H C H H C C H H H H H H H
charge: 1
multiplicity: 1
keywords: DSD-PBEP86/2013 def2-TZVP RIJCOSX verytightscf def2-TZVP/C def2/J soscf noTRAH
formula: C8H13
InChI: InChI=1/C8H13/c1-2-4-6-8-7-5-3-1/h1-2,7H,3-6,8H2
21 atoms
C  -1.990782 0.556493 0.107938
H  -2.16661 0.740522 1.17234
C  -1.882965 -0.9760 -0.174878
H  -2.665509 -1.537714 0.341289
C  -0.473531 -1.246132 0.319983
C  0.631481 -1.195647 -0.470835
C  1.922378 -0.678925 0.07204
H  2.056743 -0.947877 1.125093
H  2.790331 -1.038788 -0.489238
C  1.849193 0.877006 -0.07356
H  1.917483 1.146431 -1.134312
H  2.698287 1.347633 0.430076
C  0.520982 1.462799 0.508768
C  -0.624517 1.033854 -0.303024
H  0.531593 -1.303441 -1.55127
H  -1.961536 -1.173004 -1.248844
H  0.38619 1.235923 1.570096
H  -0.497462 1.181549 -1.379588
H  -2.781279 1.036046 -0.480754
H  0.602328 2.561963 0.407329
H  -0.335865 -1.227582 1.402714
totalener: -311.16577990 hartree
nucrepener: 382.04193197 hartree
electener: -693.20771188 hartree
oneelecener: -1164.44954513 hartree
twoeener: 471.24183326 hartree
kineticenergy: 309.99822987 hartree
exchangeener: -12.758142181854 hartree
correlationener: -0.945118821983 hartree
xcener: -13.703261003836 hartree
chargesum: 1.0000000
charge: -0.207708 0.170508 -0.206166 0.177760 -0.126608 -0.129959 -0.222739 0.157241 0.170391 -0.238774 0.150765 0.174765 -0.191031 0.063410 0.179705 0.163427 0.161149 0.204699 0.181600 0.197907 0.169658
charge: -0.197432 0.157243 -0.194833 0.150258 -0.085477 -0.101125 -0.217032 0.151564 0.154790 -0.201702 0.145371 0.150395 -0.219197 0.161091 0.157597 0.152674 0.156110 0.173613 0.159032 0.187861 0.159201
qa: -0.2077 0.1705 -0.2062 0.1778 -0.1266 -0.1300 -0.2227 0.1572 0.1704 -0.2388 0.1508 0.1748 -0.1910 0.0634 0.1797 0.1634 0.1611 0.2047 0.1816 0.1979 0.1697
va: 3.8466 0.9699 3.8524 0.9701 3.8621 3.8587 3.8989 0.9712 0.9704 3.8658 0.9716 0.9638 3.8910 3.5758 0.9592 0.9740 0.9730 0.9428 0.9688 0.9593 0.9632
total: -311.847636730 hartree
energy: -311.847636730204
dipole: 0.53854 -0.97326 -0.43473 1.89250 -1.09297 0.79953 0.15437 -0.32627 -0.17191
magnitude: 0.92617 au
magnitude: 2.35413 debye
