program: Orca
programVersion: 5.0.3
elementType: C H C H C C C H H C H H C C H H H H H H H
charge: 1
multiplicity: 1
keywords: DSD-PBEP86 cc-pVTZ EnGrad RIJCOSX verytightscf cc-pVTZ/C def2/J soscf
formula: C8H13
InChI: InChI=1/C8H13/c1-2-4-6-8-7-5-3-1/h1-2,7H,3-6,8H2
21 atoms
C  -1.989926 0.565932 0.10131
H  -2.166235 0.747497 1.166609
C  -1.864111 -0.970542 -0.174585
H  -2.661125 -1.521925 0.331294
C  -0.462243 -1.268759 0.331099
C  0.637503 -1.211841 -0.46024
C  1.928962 -0.685464 0.072563
H  2.074092 -0.946276 1.126167
H  2.797632 -1.037586 -0.493145
C  1.839818 0.867839 -0.083638
H  1.89749 1.132794 -1.146018
H  2.685105 1.35269 0.413002
C  0.509095 1.450537 0.511011
C  -0.645139 1.083948 -0.310601
H  0.529645 -1.294537 -1.542591
H  -1.934632 -1.167356 -1.249239
H  0.370177 1.190365 1.563736
H  -0.528116 1.282985 -1.380408
H  -2.79513 1.019918 -0.487404
H  0.614673 2.551151 0.442653
H  -0.329374 -1.266632 1.414461
totalener: -311.15775948 hartree
nucrepener: 381.33132632 hartree
electener: -692.48908580 hartree
oneelecener: -1163.01389420 hartree
twoeener: 470.52480839 hartree
kineticenergy: 309.72160811 hartree
exchangeener: -12.754368567262 hartree
correlationener: -0.944178215803 hartree
xcener: -13.698546783065 hartree
chargesum: 1.0000000
charge: -0.229923 0.178733 -0.230597 0.183639 -0.118877 -0.142371 -0.244356 0.165911 0.182152 -0.249235 0.159010 0.183811 -0.236503 0.027276 0.207888 0.167770 0.174314 0.229941 0.187613 0.211490 0.192315
charge: 0.088089 0.005816 0.090983 0.000190 0.104674 0.085541 0.071404 -0.000743 0.006050 0.106063 -0.006872 -0.000006 0.068752 0.332379 -0.011005 0.000563 0.003709 0.013859 0.009015 0.039810 -0.008270
qa: -0.2299 0.1787 -0.2306 0.1836 -0.1189 -0.1424 -0.2444 0.1659 0.1822 -0.2492 0.1590 0.1838 -0.2365 0.0273 0.2079 0.1678 0.1743 0.2299 0.1876 0.2115 0.1923
va: 3.8601 0.9802 3.8990 0.9742 3.8317 3.8401 3.9133 0.9845 0.9761 3.8855 0.9822 0.9715 3.9107 3.5948 0.9691 0.9853 0.9832 0.9573 0.9751 0.9645 0.9790
energy: -311.858217282303
dipole: 0.51931 -0.89468 -0.37537 1.91260 -1.10605 0.80656 0.14891 -0.28135 -0.13244
magnitude: 0.89943 au
magnitude: 2.28617 debye
