program: Orca
programVersion: 5.0.3
elementType: C H C H C C C H H C H H C C H H H H H H H
charge: 1
multiplicity: 1
keywords: PBE0 cc-pVTZ EnGrad D3BJ RIJCOSX verytightscf cc-pVTZ/C def2/J soscf
formula: C8H13
InChI: InChI=1/C8H13/c1-2-4-6-8-7-5-3-1/h1-2,7H,3-6,8H2
21 atoms
C  -1.9971 0.75276 0.073295
H  -2.174261 0.849358 1.147552
C  -1.736968 -0.952177 -0.151517
H  -2.618426 -1.321147 0.377849
C  -0.422599 -1.379249 0.398222
C  0.690412 -1.281616 -0.370565
C  2.004534 -0.688282 0.064893
H  2.215661 -0.879815 1.122702
H  2.857545 -1.030139 -0.526602
C  1.793887 0.876356 -0.144525
H  1.84586 1.127444 -1.209335
H  2.60069 1.417798 0.355504
C  0.421839 1.252398 0.472101
C  -0.764132 1.311616 -0.37941
H  0.526861 -1.211509 -1.4506
H  -1.839856 -1.122361 -1.223863
H  0.153556 0.42416 1.142329
H  -0.649164 1.499546 -1.450531
H  -2.877316 0.984639 -0.525568
H  0.424624 2.073921 1.214157
H  -0.34279 -1.501821 1.478972
totalener: -312.02153374 hartree
nucrepener: 380.02560564 hartree
electener: -692.04713937 hartree
oneelecener: -1161.01444694 hartree
twoeener: 468.96730757 hartree
kineticenergy: 309.63729065 hartree
exchangeener: -34.144999462471 hartree
correlationener: -1.962970546081 hartree
xcener: -36.107970008552 hartree
chargesum: 1.0000000
charge: -0.200951 0.172073 -0.188345 0.173644 -0.140476 -0.089926 -0.175127 0.133657 0.147749 -0.200442 0.138287 0.151854 -0.205420 0.112691 0.141556 0.166324 0.142740 0.192457 0.178164 0.193824 0.155665
charge: 0.127465 0.012705 0.162058 0.009666 0.020414 0.082746 0.078747 -0.003628 -0.002945 0.107602 -0.011112 -0.000543 0.079824 0.296349 -0.014611 -0.000282 0.009258 0.013627 0.007774 0.043133 -0.018248
qa: -0.2010 0.1721 -0.1883 0.1736 -0.1405 -0.0899 -0.1751 0.1337 0.1477 -0.2004 0.1383 0.1519 -0.2054 0.1127 0.1416 0.1663 0.1427 0.1925 0.1782 0.1938 0.1557
va: 3.8637 0.9827 3.8933 0.9782 3.8212 3.8256 3.8855 0.9951 0.9874 3.8741 0.9935 0.9872 3.8619 3.5840 0.9937 0.9835 1.0276 0.9791 0.9818 0.9787 0.9965
dispcorr: -0.019056171 hartree
energy: -312.040589906887
dipole: 0.11512 -0.91872 -0.80360 1.22673 -0.25858 0.96815 0.42395 -0.49774 -0.07379
magnitude: 1.26037 au
magnitude: 3.20361 debye
