program: Orca
programVersion: 5.0.3
charge: 1
multiplicity: 1
keywords: DLPNO-CCSD(T1) tightPNO Extrapolate(3/4,def2) RIJK def2/JK verytightSCF miniprint nopop
formula: C8H13
InChI: InChI=1/C8H13/c1-2-4-6-8-7-5-3-1/h1-2,7H,3-6,8H2
21 atoms
C  -2.003188 0.732475 0.07026
H  -2.171557 0.803273 1.147955
C  -1.737325 -0.974824 -0.168646
H  -2.622208 -1.354151 0.347771
C  -0.410202 -1.381127 0.384275
C  0.678489 -1.269194 -0.393122
C  1.991925 -0.703744 0.064015
H  2.192206 -0.919488 1.118867
H  2.850633 -1.038219 -0.525319
C  1.790254 0.834242 -0.128861
H  1.823075 1.097733 -1.19193
H  2.596977 1.383837 0.363445
C  0.430251 1.310297 0.497958
C  -0.762355 1.284124 -0.349583
H  0.515411 -1.188223 -1.472444
H  -1.828578 -1.138695 -1.24356
H  0.235882 0.818798 1.453982
H  -0.658328 1.637441 -1.3796
H  -2.877357 0.996233 -0.52454
H  0.533059 2.395348 0.725759
H  -0.321113 -1.462019 1.466882
e0: -310.287252302 hartree
corrType: DLPNO BASED
e0: -310.300967889 hartree
basis: def2-TZVPP def2-QZVPP
scfener: -310.287252302 -310.300967889
corrmethod: MDCI MDCI
correner: -1.448575121 -1.519034684
corrcbsextra: -1.571226914
energy: -311.874083970280
dipole: 0.25106 -1.10943 -0.85837 1.90253 -0.54364 1.35890 0.26897 -0.48745 -0.21848
magnitude: 1.62208 au
magnitude: 4.12299 debye
