program: Gaussian 09
title: 000051469
version: EM64L-G09RevD.01
frameworkgroup: C1[X(C22H29NO2)]
method: RPBEPBE
basis: SDD
operation: Freq
keyword: #p
keyword: freq=noraman
keyword: PBEPBE/SDD
title: #p freq=noraman PBEPBE/SDD
converged: YES YES NO NO
title: Mulliken charges:
elementType: O O N C C C C C C C C C C C C C C C C C C C C C C H H H H H H H H H H H H H H H H H H H H H H H H H H H H H
charge: -0.479543 -0.269110 -0.075622 0.247048 -0.517656 -0.484793 -0.404698 -0.477724 0.490306 -0.428606 -0.372782 -0.203406 -0.554262 -0.453759 -0.699062 0.292306 -0.234923 0.440428 -0.384944 -0.446981 -0.388265 -0.218459 -0.225993 -0.241967 -0.537870 0.230662 0.215209 0.212576 0.240259 0.214136 0.195664 0.187145 0.197868 0.220563 0.228412 0.214639 0.223818 0.211030 0.237946 0.294895 0.218204 0.205253 0.208375 0.218929 0.248612 0.344895 0.235837 0.264928 0.225897 0.225583 0.228985 0.218711 0.243869 0.217435
chargesum: 0.00000
title: Mulliken charges with hydrogens summed into heavy atoms:
elementType: O O N C C C C C C C C C C C C C C C C C C C C C C
charge: -0.134648 -0.269110 -0.075622 0.247048 -0.071785 -0.031959 0.005102 -0.092710 0.490306 0.020369 0.065675 0.007624 -0.316315 -0.158864 -0.067230 0.292306 -0.015994 0.440428 -0.136332 -0.211144 -0.123337 0.007438 -0.000410 -0.012982 0.142146
polarizability: 3.41072929e+02 1.26506077e-01 2.28854325e+02 1.52829577e+01 -3.99993691e+00 1.95409898e+02
1716.lowfreq: -12.7251 -6.8569 -4.2660 0.0003 0.0004 0.0008 10.7491 21.1860 29.4837
frequency: -5.0198 20.5719 29.4266 40.9475 53.9657 63.0562 69.7530 86.5126 95.6925 101.4003 105.5272 145.6578 158.0563 192.6686 207.7290 219.3903 223.7839 239.2595 253.0364 262.1701 279.7981 296.2977 304.4987 327.0806 332.9695 352.8438 362.9446 376.8950 404.9324 435.7092 443.4564 466.3636 486.1339 515.8600 533.9150 546.6174 583.1731 592.7718 614.9943 652.9943 657.7625 681.3565 706.6588 713.6207 744.5331 764.2423 796.0974 803.3787 822.3183 832.8469 849.7439 856.2711 861.2021 865.6931 881.1550 893.8693 906.3417 915.0842 920.7080 959.9876 975.9036 978.2055 982.0814 986.2780 988.2224 993.6830 996.4096 1004.6089 1009.9052 1025.8431 1042.1557 1047.0570 1065.2268 1077.7037 1081.1594 1111.5875 1116.7674 1120.5348 1128.7832 1145.3783 1155.5804 1162.8807 1165.0639 1171.7617 1182.6604 1185.2522 1197.6375 1199.7006 1214.7398 1231.0224 1233.2585 1268.5789 1275.0808 1282.1024 1284.7578 1291.1211 1301.0921 1309.3488 1317.0930 1328.2778 1335.1602 1343.0758 1358.4316 1361.9573 1380.1876 1383.9878 1387.5848 1388.6468 1419.7188 1430.2947 1439.8251 1443.6423 1459.2581 1464.2745 1469.2247 1470.0839 1475.6771 1477.4857 1479.5349 1486.7812 1487.2777 1500.8958 1520.4996 1590.0875 1599.3649 1602.3819 1610.3843 2871.9167 2912.4691 2953.0755 2953.1576 2962.5300 2963.0087 2969.0742 2975.3740 2979.9187 3005.2458 3006.5184 3025.4556 3030.6345 3034.2494 3038.3577 3066.1957 3070.3227 3077.5675 3113.9532 3119.8053 3123.1053 3124.5951 3136.7985 3142.3600 3146.8605 3147.7465 3163.3520 3167.8113 3550.0887
redmass: 4.7912 3.8411 4.0669 4.4649 3.6971 4.7837 3.6620 3.9760 2.9306 2.3986 3.1307 2.9114 3.0553 1.7245 4.6200 2.6388 1.8147 1.8564 3.9904 2.0623 2.6781 2.9385 2.7423 2.7607 2.2722 2.3335 2.1422 1.8599 2.7230 3.1373 4.1698 3.0457 3.0267 3.2704 3.2103 3.6805 3.8432 4.3727 6.4394 4.4753 3.4718 5.1343 1.7240 2.1474 1.1299 1.9314 2.2567 1.6456 4.3355 2.8311 3.1363 1.2602 1.5531 1.6259 2.0545 1.8169 1.8875 1.5231 1.5246 2.3383 2.5248 1.4379 3.8961 1.5128 6.2595 2.0491 1.3344 2.9047 2.4917 2.1410 2.5192 2.1559 2.0412 1.8137 1.6229 1.2622 2.1790 1.7374 1.9150 1.4121 1.3413 1.3525 1.5827 1.0577 1.1366 1.4944 1.6495 2.2780 1.7623 1.4857 1.9839 2.0340 1.6135 1.4311 1.5150 1.3465 1.2869 1.3371 1.3175 1.4214 1.2784 1.5073 1.4979 1.3317 2.5737 3.8962 1.6331 1.8778 1.8555 1.1363 2.0661 1.4150 1.1108 1.0536 1.1668 1.0753 1.0679 1.0442 2.2829 1.5921 1.1723 1.1035 1.1078 6.0191 5.9100 5.8845 6.0512 1.0708 1.0728 1.0459 1.0681 1.0621 1.0580 1.0371 1.0857 1.0615 1.0676 1.0947 1.0978 1.0935 1.1016 1.1036 1.1012 1.0990 1.1021 1.0872 1.0988 1.0872 1.0860 1.0913 1.0942 1.0896 1.0959 1.1014 1.0965 1.0660
irintensity: 0.2241 0.5187 0.5072 0.1488 0.3392 1.0329 1.1592 0.1157 3.4454 3.8175 1.0543 0.8032 3.9145 1.1490 4.7390 1.7583 1.1440 1.3524 4.5691 1.6094 3.4791 0.5764 3.3130 2.3273 27.2132 63.4269 38.1857 71.7007 4.3454 5.6108 4.2748 5.3558 15.3525 19.6842 3.7041 5.2345 9.4811 7.8941 0.3187 1.8796 0.5070 1.1096 52.2174 25.2513 12.3936 32.6226 12.9588 38.2657 11.7667 16.8128 8.2077 0.8786 6.5411 24.1163 0.6524 4.0903 6.3084 17.0284 3.3652 20.3992 68.4612 5.4720 3.9622 6.4635 0.0655 9.9772 2.5762 34.7042 27.2900 5.8040 0.5679 17.2833 0.2590 3.8977 6.7992 0.2325 17.4986 1.4541 23.3734 42.3237 1.3965 11.1660 32.2432 0.0511 0.0359 15.2764 20.9534 2.9076 25.9711 4.2254 91.0075 76.2545 29.0957 15.4885 12.0034 6.2010 2.3933 6.7058 3.5415 23.8654 2.5482 75.7104 1.0637 1.0170 2.5748 2.8556 6.9494 8.4400 35.9947 7.1848 10.8569 7.3416 14.0347 13.9267 68.8489 10.6056 11.2042 13.5726 20.0655 16.5925 17.8205 14.5745 8.0960 0.8492 59.0489 83.5174 15.8735 84.0152 109.2243 61.8259 15.7420 60.7446 23.4399 56.0602 46.2654 27.6469 72.9517 19.4235 11.5711 32.1297 16.2149 51.1068 77.8787 46.6916 49.5543 9.0290 31.8252 30.0228 0.1776 15.4176 8.2520 12.4376 32.1637 27.7410 13.8020 3.4770
temp: 298.150 k
press: 1.00000 atm
elementType: 8 8 7 6 6 6 6 6 6 6 6 6 6 6 6 6 6 6 6 6 6 6 6 6 6 1 1 1 1 1 1 1 1 1 1 1 1 1 1 1 1 1 1 1 1 1 1 1 1 1 1 1 1 1
symmnumber: 1
zpe: 1206694.1 jmol-1
zpe.correction: 0.459606 hartree
zpe.thermalcorrener: 0.483628 hartree
zpe.thermalcorrenthalpy: 0.484572 hartree
zpe.thermalcorrgfe: 0.405156 hartree
zpe.sumelectzpe: -1059.023630 hartree
zpe.sumelectthermal: -1058.999607 hartree
zpe.sumelectthermalent: -1058.998663 hartree
zpe.sumelectthermalfe: -1059.078079 hartree
dipole: -0.5891 0.0787 1.3059
dipole: 1.4348
quadrupole: -130.8548 -153.5200 -147.4433
quadrupole: 6.9486 10.0241 -2.5139
quadrupole: 13.0846 -9.5807 -3.5039 6.9486 10.0241 -2.5139
hfenergy: -1059.483235 hartree
pointgroup: C01 [X(C22H29N1O2)]
dipole: 0.2636239 0.1308316 -0.4817073 debye
polarizability: 338.3789433|-11.2703624|226.3168627|22.1391086|9.4429351|200.6413462 unknown
InChI: InChI=1S/C22H29NO2/c1-3-12-22(19-10-7-11-20(15-19)25-2)13-14-23(17-22)16-21(24)18-8-5-4-6-9-18/h4-11,15,21,24H,3,12-14,16-17H2,1-2H3
charge 0 multiplicity 1
54 atoms
O  1.927839 -0.26753 1.497258
O  -4.992111 -2.228938 -0.902436
N  0.829768 1.488919 -0.757319
C  -1.567988 1.453532 -0.422344
C  -1.191301 1.550987 -1.947105
C  -0.204753 1.823355 0.249251
C  0.237621 0.973937 -2.002559
C  -2.663017 2.495081 -0.043408
C  -2.037206 0.006517 -0.127225
C  2.207381 1.20969 -0.410642
C  -3.04164 2.515286 1.454907
C  2.523444 -0.223494 0.139286
C  -3.293661 -0.417372 -0.647967
C  -1.260731 -0.927107 0.600281
C  -4.124843 3.568434 1.772866
C  -3.761366 -1.732649 -0.430283
C  -1.738697 -2.245126 0.811048
C  4.017688 -0.497523 0.177115
C  -2.983618 -2.659489 0.307398
C  4.634021 -1.272119 -0.838384
C  4.826807 0.062725 1.201053
C  6.031248 -1.482356 -0.835778
C  6.223045 -0.149726 1.20621
C  6.830687 -0.921618 0.187602
C  -5.840517 -1.317504 -1.669336
H  -1.899238 1.004046 -2.592603
H  -1.177079 2.614238 -2.25393
H  -0.192536 2.914108 0.471293
H  -0.043035 1.297825 1.207015
H  0.803305 1.32892 -2.888257
H  0.199865 -0.141497 -2.05253
H  -3.580181 2.317146 -0.641317
H  -2.294997 3.49945 -0.339472
H  2.841531 1.357601 -1.308474
H  2.557408 1.927565 0.357933
H  -2.137498 2.722853 2.061439
H  -3.397105 1.511159 1.756388
H  2.020168 -0.971542 -0.511412
H  -3.900667 0.289563 -1.222541
H  -0.283113 -0.645074 1.003731
H  -4.380308 3.572934 2.848477
H  -5.054299 3.365489 1.206977
H  -3.784155 4.586126 1.502127
H  -1.128203 -2.956374 1.379877
H  -3.36918 -3.67134 0.46456
H  2.214497 -1.10687 1.939873
H  4.016724 -1.716548 -1.62979
H  4.352005 0.655737 1.99088
H  6.494704 -2.086795 -1.623771
H  6.838173 0.285278 2.002352
H  7.913812 -1.087609 0.193501
H  -6.138967 -0.437165 -1.066176
H  -6.732832 -1.905414 -1.931104
H  -5.336099 -0.975521 -2.594832
