program: Orca
programVersion: 5.0.3
elementType: C H C H C C C H H C H H C C H H H H H H H
charge: 1
multiplicity: 1
keywords: PBE0 def2-TZVP EnGrad RIJCOSX verytightscf def2/J soscf
formula: C8H13
InChI: InChI=1/C8H13/c1-2-4-6-8-7-5-3-1/h1-2,7H,3-6,8H2
21 atoms
C  -1.999505 0.521185 0.113332
H  -2.182929 0.728382 1.170986
C  -1.984345 -1.008092 -0.161191
H  -2.679588 -1.602931 0.432279
C  -0.535619 -1.096274 0.27446
C  0.598386 -1.090107 -0.514615
C  1.904013 -0.638622 0.055082
H  1.997855 -0.956729 1.098841
H  2.747051 -1.045485 -0.509467
C  1.918473 0.928281 -0.018234
H  2.077538 1.239058 -1.057198
H  2.755255 1.317376 0.567697
C  0.568012 1.476978 0.482474
C  -0.518642 0.744065 -0.249381
H  0.518562 -1.283964 -1.583688
H  -2.115776 -1.23619 -1.222679
H  0.456175 1.382488 1.56782
H  -0.407119 0.821457 -1.334242
H  -2.682661 1.114409 -0.501041
H  0.488028 2.545838 0.236148
H  -0.380201 -1.049322 1.353155
totalener: -312.08977366 hartree
nucrepener: 386.92525414 hartree
electener: -699.01502780 hartree
oneelecener: -1174.68111864 hartree
twoeener: 475.66609084 hartree
kineticenergy: 310.18914183 hartree
exchangeener: -34.196913863078 hartree
correlationener: -1.977833311821 hartree
xcener: -36.174747174899 hartree
chargesum: 1.0000000
charge: -0.186268 0.162240 -0.189438 0.176930 -0.048187 -0.043727 -0.222062 0.162333 0.178340 -0.241299 0.156472 0.175085 -0.189645 -0.099310 0.201499 0.157177 0.147795 0.173660 0.174790 0.179837 0.173777
charge: -0.192067 0.158307 -0.187421 0.155013 -0.066401 -0.015028 -0.208641 0.162008 0.164794 -0.213970 0.153169 0.157125 -0.229612 -0.013040 0.170310 0.157681 0.156508 0.178235 0.155462 0.178039 0.179530
qa: -0.1863 0.1622 -0.1894 0.1769 -0.0482 -0.0437 -0.2221 0.1623 0.1783 -0.2413 0.1565 0.1751 -0.1896 -0.0993 0.2015 0.1572 0.1478 0.1737 0.1748 0.1798 0.1738
va: 3.9270 0.9756 3.9318 0.9706 3.9236 3.8573 3.9633 0.9668 0.9675 3.9519 0.9699 0.9658 3.9669 3.9106 0.9461 0.9742 0.9741 0.9606 0.9693 0.9655 0.9622
energy: -312.089773659361
dipole: 0.55495 -0.66613 -0.11119 1.84815 -1.87574 -0.02759 0.20473 -0.36954 -0.16481
magnitude: 0.20072 au
magnitude: 0.51018 debye
