program: Orca
programVersion: 5.0.3
charge: 1
multiplicity: 1
keywords: DLPNO-CCSD(T1) tightPNO Extrapolate(3/4,def2) RIJK def2/JK verytightSCF miniprint nopop
formula: C8H13
InChI: InChI=1/C8H13/c1-2-4-6-8-7-5-3-1/h1-2,7H,3-6,8H2
21 atoms
C  -1.989926 0.565932 0.10131
H  -2.166235 0.747497 1.166609
C  -1.864111 -0.970542 -0.174585
H  -2.661125 -1.521925 0.331294
C  -0.462243 -1.268759 0.331099
C  0.637503 -1.211841 -0.46024
C  1.928962 -0.685464 0.072563
H  2.074092 -0.946276 1.126167
H  2.797632 -1.037586 -0.493145
C  1.839818 0.867839 -0.083638
H  1.89749 1.132794 -1.146018
H  2.685105 1.35269 0.413002
C  0.509095 1.450537 0.511011
C  -0.645139 1.083948 -0.310601
H  0.529645 -1.294537 -1.542591
H  -1.934632 -1.167356 -1.249239
H  0.370177 1.190365 1.563736
H  -0.528116 1.282985 -1.380408
H  -2.79513 1.019918 -0.487404
H  0.614673 2.551151 0.442653
H  -0.329374 -1.266632 1.414461
e0: -310.308581597 hartree
corrType: DLPNO BASED
e0: -310.322252631 hartree
basis: def2-TZVPP def2-QZVPP
scfener: -310.308581597 -310.322252631
corrmethod: MDCI MDCI
correner: -1.446628860 -1.517037692
corrcbsextra: -1.569192344
energy: -311.893328005278
dipole: 0.51931 -1.06763 -0.54832 1.91260 -0.86486 1.04774 0.14891 -0.34677 -0.19785
magnitude: 1.19899 au
magnitude: 3.04758 debye
