program: Orca
programVersion: 5.0.3
elementType: C H C H C C C H H C H H C C H H H H H H H
charge: 1
multiplicity: 1
keywords: m062x def2-TZVP EnGrad RIJCOSX verytightscf def2/J soscf
formula: C8H13
InChI: InChI=1/C8H13/c1-2-4-6-8-7-5-3-1/h1-2,7H,3-6,8H2
21 atoms
C  -1.992741 0.599047 0.085283
H  -2.170537 0.770258 1.153383
C  -1.819763 -0.955896 -0.172309
H  -2.648039 -1.479005 0.314377
C  -0.436293 -1.314357 0.355274
C  0.653739 -1.24318 -0.43474
C  1.949952 -0.699498 0.072116
H  2.120709 -0.943014 1.12583
H  2.81744 -1.034784 -0.506528
C  1.820784 0.848043 -0.104322
H  1.86174 1.106528 -1.168621
H  2.651596 1.364385 0.384772
C  0.477725 1.410658 0.509236
C  -0.693509 1.182465 -0.323512
H  0.524436 -1.256596 -1.519285
H  -1.87755 -1.151047 -1.247947
H  0.326632 1.073674 1.537335
H  -0.600539 1.496815 -1.368095
H  -2.825974 0.992772 -0.505456
H  0.620621 2.511367 0.51923
H  -0.317145 -1.356203 1.438906
totalener: -312.28593228 hartree
nucrepener: 380.10891249 hartree
electener: -692.39484477 hartree
oneelecener: -1161.02996460 hartree
twoeener: 468.63511983 hartree
kineticenergy: 310.38827306 hartree
xcener: -23.090344010517 hartree
chargesum: 1.0000000
charge: -0.310634 0.217499 -0.305104 0.202584 -0.165814 -0.113208 -0.335754 0.201378 0.197221 -0.303438 0.201440 0.199715 -0.279287 0.115488 0.184766 0.208443 0.207709 0.240396 0.207366 0.236988 0.192245
charge: -0.199647 0.170736 -0.194895 0.157218 -0.125261 -0.141677 -0.227953 0.156633 0.160902 -0.199609 0.151660 0.156883 -0.215868 0.162780 0.157941 0.158524 0.164719 0.177301 0.167068 0.206536 0.156010
qa: -0.3106 0.2175 -0.3051 0.2026 -0.1658 -0.1132 -0.3358 0.2014 0.1972 -0.3034 0.2014 0.1997 -0.2793 0.1155 0.1848 0.2084 0.2077 0.2404 0.2074 0.2370 0.1922
va: 3.7344 0.9424 3.7233 0.9574 3.6818 3.6482 3.7642 0.9501 0.9591 3.6971 0.9445 0.9538 3.7031 3.3640 0.9551 0.9486 0.9533 0.9262 0.9577 0.9391 0.9536
energy: -312.285932281758
dipole: 0.45289 -0.97143 -0.51854 1.96144 -0.72884 1.23260 0.14777 -0.29060 -0.14283
magnitude: 1.34484 au
magnitude: 3.41831 debye
