program: Orca
programVersion: 5.0.3
elementType: C H C H C C C H H C H H C C H H H H H H H
charge: 1
multiplicity: 1
keywords: DSD-PBEP86/2013 cc-pVTZ EnGrad D3BJ RIJCOSX verytightscf cc-pVTZ/C def2/J soscf
formula: C8H13
InChI: InChI=1/C8H13/c1-2-4-6-8-7-5-3-1/h1-2,7H,3-6,8H2
21 atoms
C  -1.992638 0.518461 0.066236
H  -2.198588 0.793208 1.103964
C  -2.000169 -1.023444 -0.115935
H  -2.679187 -1.575199 0.534617
C  -0.542497 -1.0842 0.292665
C  0.570328 -1.057653 -0.530092
C  1.901363 -0.628065 0.011731
H  2.027185 -1.005446 1.032218
H  2.71703 -1.019818 -0.601062
C  1.936942 0.939041 0.025869
H  2.147062 1.304719 -0.985322
H  2.748016 1.285744 0.671259
C  0.567452 1.467847 0.492711
C  -0.490204 0.7071 -0.263952
H  0.463696 -1.27398 -1.592038
H  -2.159971 -1.32106 -1.155763
H  0.430154 1.368112 1.574808
H  -0.362627 0.803085 -1.345603
H  -2.646734 1.086252 -0.600313
H  0.469498 2.534359 0.248028
H  -0.360979 -1.025853 1.366424
totalener: -311.17390891 hartree
nucrepener: 387.55730452 hartree
electener: -698.73121343 hartree
oneelecener: -1175.29582120 hartree
twoeener: 476.56460777 hartree
kineticenergy: 309.76069476 hartree
exchangeener: -14.132072376382 hartree
correlationener: -0.949795311305 hartree
xcener: -15.081867687687 hartree
chargesum: 1.0000000
charge: -0.211605 0.169233 -0.241457 0.184227 -0.033699 -0.041145 -0.251508 0.165388 0.180900 -0.247668 0.162186 0.178944 -0.236871 -0.092801 0.223777 0.169312 0.157493 0.192043 0.181720 0.189870 0.201662
charge: 0.110592 -0.000259 0.109879 -0.000890 0.127775 0.181062 0.086951 0.002340 0.005743 0.096755 -0.006693 -0.000687 0.067269 0.185547 0.005980 -0.000672 -0.004334 0.004863 -0.002566 0.014989 0.016358
qa: -0.2116 0.1692 -0.2415 0.1842 -0.0337 -0.0411 -0.2515 0.1654 0.1809 -0.2477 0.1622 0.1789 -0.2369 -0.0928 0.2238 0.1693 0.1575 0.1920 0.1817 0.1899 0.2017
va: 3.8641 0.9856 3.8872 0.9777 3.7755 3.7630 3.9192 0.9821 0.9773 3.8929 0.9809 0.9746 3.8899 3.7733 0.9603 0.9852 0.9854 0.9834 0.9753 0.9686 0.9776
dispcorr: -0.013653837 hartree
energy: -311.862092836136
dipole: 0.55716 -0.71965 -0.16249 1.82918 -1.94703 -0.11785 0.23526 -0.40489 -0.16963
magnitude: 0.26280 au
magnitude: 0.66800 debye
