program: Orca
programVersion: 5.0.3
elementType: C H C H C C C H H C H H C C H H H H H H H
charge: 1
multiplicity: 1
keywords: DSD-PBEP86 cc-pVTZ EnGrad RIJCOSX verytightscf cc-pVTZ/C def2/J soscf
formula: C8H13
InChI: InChI=1/C8H12.H/c1-2-4-6-8-7-5-3-1;/h1-2,7-8H,3-6H2;
21 atoms
C  -1.982255 0.65804 0.117092
H  -2.149551 0.849552 1.181618
C  -1.843332 -0.944021 -0.123823
H  -2.65064 -1.440419 0.417651
C  -0.46539 -1.342671 0.380296
C  0.67756 -1.263252 -0.378552
C  1.983096 -0.658712 0.105221
H  2.154188 -0.859768 1.167393
H  2.846063 -1.011422 -0.462468
C  1.843808 0.944671 -0.121309
H  1.952213 1.167941 -1.187387
H  2.651524 1.437629 0.422719
C  0.466224 1.336778 0.389917
C  -0.679675 1.268392 -0.366187
H  0.547446 -1.264029 -1.464184
H  -1.954702 -1.157391 -1.191602
H  0.000677 0.001767 0.03262
H  -0.553923 1.281958 -1.452198
H  -2.847783 1.014456 -0.444313
H  0.350159 1.326738 1.476332
H  -0.346542 -1.345174 1.466979
totalener: -311.10151561 hartree
nucrepener: 382.90943967 hartree
electener: -694.01095529 hartree
oneelecener: -1165.67465455 hartree
twoeener: 471.66369926 hartree
kineticenergy: 309.66367730 hartree
exchangeener: -12.749404230822 hartree
correlationener: -0.949523171967 hartree
xcener: -13.698927402789 hartree
chargesum: 1.0000000
charge: -0.261087 0.174908 -0.262005 0.189173 -0.063360 -0.057619 -0.260868 0.174809 0.188169 -0.261788 0.173079 0.189134 -0.063209 -0.057008 0.187790 0.173131 0.078990 0.188288 0.188276 0.190633 0.190564
charge: 0.109000 -0.002951 0.110308 0.002204 0.136535 0.142445 0.108900 -0.002994 0.002405 0.110478 -0.003226 0.002197 0.137130 0.143820 0.003624 -0.003235 -0.010676 0.003733 0.002465 0.003989 0.003848
qa: -0.2611 0.1749 -0.2620 0.1892 -0.0634 -0.0576 -0.2609 0.1748 0.1882 -0.2618 0.1731 0.1891 -0.0632 -0.0570 0.1878 0.1731 0.0790 0.1883 0.1883 0.1906 0.1906
va: 3.9024 0.9803 3.9043 0.9726 3.8027 3.8053 3.9025 0.9804 0.9732 3.9041 0.9815 0.9727 3.8025 3.8044 0.9817 0.9815 1.1544 0.9815 0.9731 0.9813 0.9812
energy: -311.817395869710
dipole: -0.00077 -0.00143 -0.00220 0.00256 0.00271 0.00527 -0.03398 0.02853 -0.00544
magnitude: 0.00789 au
magnitude: 0.02005 debye
