program: Orca
programVersion: 5.0.3
elementType: C H C H C C C H H C H H C C H H H H H H H
charge: 1
multiplicity: 1
keywords: PBE0 cc-pVTZ EnGrad RIJCOSX verytightscf cc-pVTZ/C def2/J soscf
formula: C8H13
InChI: InChI=1/C8H13/c1-2-4-6-8-7-5-3-1/h1-2,7H,3-6,8H2
21 atoms
C  -1.999288 0.523304 0.11658
H  -2.180586 0.724731 1.175756
C  -1.97688 -1.004902 -0.164804
H  -2.678298 -1.600968 0.42035
C  -0.531002 -1.106559 0.275424
C  0.602314 -1.099382 -0.511677
C  1.904826 -0.642386 0.05884
H  1.999235 -0.954549 1.104325
H  2.751817 -1.045886 -0.502284
C  1.9118 0.924194 -0.023736
H  2.060897 1.228753 -1.066096
H  2.7524 1.320557 0.551754
C  0.565465 1.478707 0.484204
C  -0.526669 0.764279 -0.25245
H  0.523597 -1.289093 -1.581628
H  -2.103573 -1.226187 -1.228392
H  0.453349 1.377977 1.568876
H  -0.411535 0.836678 -1.337145
H  -2.692299 1.111554 -0.491989
H  0.497196 2.550631 0.245234
H  -0.377558 -1.057909 1.35444
totalener: -312.08480229 hartree
nucrepener: 386.56704692 hartree
electener: -698.65184920 hartree
oneelecener: -1173.93237886 hartree
twoeener: 475.28052965 hartree
kineticenergy: 309.66444149 hartree
exchangeener: -34.175837204529 hartree
correlationener: -1.976400672413 hartree
xcener: -36.152237876943 hartree
chargesum: 1.0000000
charge: -0.153475 0.143332 -0.171686 0.155915 -0.037933 -0.033176 -0.184931 0.141592 0.157008 -0.199581 0.140646 0.152826 -0.166829 -0.080812 0.194112 0.142454 0.138459 0.170881 0.154015 0.166067 0.171115
charge: 0.102122 0.000551 0.105172 -0.000519 0.118015 0.173867 0.084592 0.003427 0.008085 0.097657 -0.004751 0.001003 0.065776 0.203208 0.004104 0.000364 -0.001005 0.004154 -0.000021 0.021459 0.012741
qa: -0.1535 0.1433 -0.1717 0.1559 -0.0379 -0.0332 -0.1849 0.1416 0.1570 -0.1996 0.1406 0.1528 -0.1668 -0.0808 0.1941 0.1425 0.1385 0.1709 0.1540 0.1661 0.1711
va: 3.8558 0.9956 3.8728 0.9877 3.7950 3.7730 3.9026 0.9927 0.9877 3.8789 0.9891 0.9856 3.8719 3.7589 0.9767 0.9961 0.9937 0.9929 0.9860 0.9807 0.9933
energy: -312.084802285288
dipole: 0.55725 -0.67513 -0.11789 1.84993 -1.84104 0.00890 0.19965 -0.35994 -0.16028
magnitude: 0.19917 au
magnitude: 0.50624 debye
