program: Orca
programVersion: 5.0.3
elementType: C H C H C C C H H C H H C C H H H H H H H
charge: 1
multiplicity: 1
keywords: b3lyp cc-pVTZ EnGrad D3BJ RIJCOSX verytightscf cc-pVTZ/C def2/J soscf
formula: C8H13
InChI: InChI=1/C8H13/c1-2-4-6-8-7-5-3-1/h1-2,7H,3-6,8H2
21 atoms
C  -1.997337 0.757331 0.071798
H  -2.167639 0.84189 1.14797
C  -1.733191 -0.958497 -0.154131
H  -2.618429 -1.316644 0.375989
C  -0.420172 -1.383194 0.395913
C  0.688589 -1.279648 -0.373114
C  2.003315 -0.689343 0.063908
H  2.213385 -0.882647 1.121545
H  2.856885 -1.0320 -0.526581
C  1.791758 0.869113 -0.143279
H  1.83982 1.124452 -1.20731
H  2.596901 1.413803 0.356302
C  0.42177 1.254446 0.479802
C  -0.76655 1.307345 -0.378189
H  0.52484 -1.208354 -1.453094
H  -1.837481 -1.123369 -1.226995
H  0.168956 0.487078 1.224729
H  -0.655465 1.541149 -1.441054
H  -2.879794 0.986557 -0.524294
H  0.442005 2.149562 1.126315
H  -0.340147 -1.49567 1.477219
totalener: -312.20151764 hartree
nucrepener: 379.77163764 hartree
electener: -691.97315527 hartree
oneelecener: -1160.56440490 hartree
twoeener: 468.59124962 hartree
kineticenergy: 309.98298997 hartree
exchangeener: -36.295215898997 hartree
correlationener: -2.304145148065 hartree
xcener: -38.599361047061 hartree
chargesum: 1.0000000
charge: -0.197478 0.167661 -0.191951 0.174721 -0.115296 -0.084913 -0.170920 0.126674 0.146540 -0.204318 0.132836 0.150381 -0.182066 0.107947 0.135243 0.162716 0.131040 0.196149 0.176448 0.192436 0.146150
charge: 0.133215 0.011426 0.171077 0.007657 0.023806 0.082743 0.081539 -0.006022 -0.004920 0.110236 -0.013623 -0.002444 0.082063 0.298780 -0.017570 -0.002248 0.009656 0.012435 0.005487 0.038993 -0.022286
qa: -0.1975 0.1677 -0.1920 0.1747 -0.1153 -0.0849 -0.1709 0.1267 0.1465 -0.2043 0.1328 0.1504 -0.1821 0.1079 0.1352 0.1627 0.1310 0.1961 0.1764 0.1924 0.1461
va: 3.8333 0.9817 3.8604 0.9724 3.7910 3.7987 3.8535 0.9935 0.9830 3.8454 0.9905 0.9819 3.8249 3.5504 0.9927 0.9814 1.0161 0.9746 0.9790 0.9729 0.9969
dispcorr: -0.036849167 hartree
energy: -312.238366806550
dipole: 0.13460 -0.97249 -0.83788 1.39094 -0.38674 1.00420 0.42216 -0.51283 -0.09067
magnitude: 1.31098 au
magnitude: 3.33226 debye
