program: Orca
programVersion: 5.0.3
elementType: C H C H C C C H H C H H C C H H H H H H H
charge: 1
multiplicity: 1
keywords: DSD-PBEP86/2013 def2-TZVP RIJCOSX verytightscf def2-TZVP/C def2/J soscf noTRAH
formula: C8H13
InChI: InChI=1/C8H13/c1-2-4-6-8-7-5-3-1/h1-2,7H,3-6,8H2
21 atoms
C  -2.00098 0.674135 0.074595
H  -2.177207 0.791453 1.149034
C  -1.765879 -0.959422 -0.172077
H  -2.632069 -1.406878 0.323827
C  -0.413159 -1.360143 0.374604
C  0.669761 -1.264186 -0.408394
C  1.976927 -0.707717 0.06807
H  2.168311 -0.935441 1.121862
H  2.840764 -1.036508 -0.518764
C  1.801621 0.832457 -0.119926
H  1.835863 1.092968 -1.183684
H  2.613847 1.375094 0.371283
C  0.444846 1.35477 0.500844
C  -0.742579 1.255922 -0.33448
H  0.516331 -1.202256 -1.489931
H  -1.83791 -1.141495 -1.247379
H  0.272287 0.945802 1.498316
H  -0.649083 1.615223 -1.364285
H  -2.859885 0.989736 -0.521043
H  0.579346 2.454862 0.606047
H  -0.314363 -1.429856 1.457796
totalener: -311.14659324 hartree
nucrepener: 379.24984499 hartree
electener: -690.39643823 hartree
oneelecener: -1158.94585475 hartree
twoeener: 468.54941652 hartree
kineticenergy: 309.99205626 hartree
exchangeener: -12.755305440728 hartree
correlationener: -0.942941330168 hartree
xcener: -13.698246770896 hartree
chargesum: 1.0000000
charge: -0.241710 0.189160 -0.213859 0.184087 -0.193646 -0.130525 -0.208074 0.154302 0.164470 -0.263836 0.154154 0.172836 -0.157109 0.122055 0.144001 0.178823 0.163247 0.219695 0.189522 0.206066 0.166342
charge: -0.177812 0.168690 -0.153076 0.153509 -0.159081 -0.142256 -0.219245 0.149175 0.150661 -0.194684 0.143645 0.150480 -0.203800 0.183528 0.151147 0.151612 0.161313 0.176664 0.159847 0.200814 0.148870
qa: -0.2417 0.1892 -0.2139 0.1841 -0.1936 -0.1305 -0.2081 0.1543 0.1645 -0.2638 0.1542 0.1728 -0.1571 0.1221 0.1440 0.1788 0.1632 0.2197 0.1895 0.2061 0.1663
va: 3.8638 0.9615 3.8469 0.9635 3.8669 3.8456 3.8780 0.9732 0.9722 3.8970 0.9682 0.9636 3.8275 3.4898 0.9680 0.9640 0.9815 0.9376 0.9663 0.9520 0.9653
total: -311.826332939 hartree
energy: -311.826332939145
dipole: 0.33360 -1.09057 -0.75697 1.97790 -0.53935 1.43855 0.19015 -0.37622 -0.18607
magnitude: 1.63617 au
magnitude: 4.15882 debye
