program: Orca
programVersion: 5.0.3
elementType: C H C H C C C H H C H H C C H H H H H H H
charge: 1
multiplicity: 1
keywords: PBE0 cc-pVTZ EnGrad D3BJ RIJCOSX verytightscf cc-pVTZ/C def2/J soscf
formula: C8H13
InChI: InChI=1/C8H13/c1-2-4-6-8-7-5-3-1/h1-2,7H,3-6,8H2
21 atoms
C  -1.998767 0.525524 0.118465
H  -2.178536 0.72308 1.178676
C  -1.969336 -1.00203 -0.167266
H  -2.677316 -1.597734 0.410584
C  -0.526339 -1.118052 0.277344
C  0.605474 -1.108227 -0.508868
C  1.905639 -0.645901 0.061507
H  2.001664 -0.953406 1.108222
H  2.755885 -1.045709 -0.497441
C  1.905503 0.920209 -0.02838
H  2.04572 1.219935 -1.073456
H  2.749065 1.323242 0.538101
C  0.562716 1.480067 0.486259
C  -0.534508 0.785526 -0.25628
H  0.526942 -1.293588 -1.579635
H  -2.091709 -1.218247 -1.232496
H  0.44942 1.372167 1.570025
H  -0.415347 0.853643 -1.340697
H  -2.701321 1.107428 -0.485736
H  0.5067 2.555129 0.255659
H  -0.374313 -1.068002 1.35661
totalener: -312.08370568 hartree
nucrepener: 386.18376086 hartree
electener: -698.26746654 hartree
oneelecener: -1173.18054851 hartree
twoeener: 474.91308197 hartree
kineticenergy: 309.66128687 hartree
exchangeener: -34.173808481353 hartree
correlationener: -1.975460938628 hartree
xcener: -36.149269419981 hartree
chargesum: 1.0000000
charge: -0.154402 0.143489 -0.170386 0.155676 -0.042340 -0.039715 -0.184451 0.141430 0.156889 -0.199736 0.140271 0.152955 -0.166162 -0.075226 0.193843 0.142390 0.139335 0.173433 0.154190 0.167494 0.171024
charge: 0.099651 0.000670 0.103292 -0.000408 0.119709 0.168319 0.083528 0.003179 0.008003 0.097655 -0.004699 0.000968 0.065415 0.212749 0.003074 0.000531 -0.000552 0.003883 0.000706 0.022989 0.011341
qa: -0.1544 0.1435 -0.1704 0.1557 -0.0423 -0.0397 -0.1845 0.1414 0.1569 -0.1997 0.1403 0.1530 -0.1662 -0.0752 0.1938 0.1424 0.1393 0.1734 0.1542 0.1675 0.1710
va: 3.8556 0.9954 3.8721 0.9877 3.7969 3.7787 3.9023 0.9928 0.9877 3.8782 0.9892 0.9855 3.8725 3.7509 0.9768 0.9961 0.9935 0.9914 0.9860 0.9804 0.9930
dispcorr: -0.018080207 hartree
energy: -312.101785886421
dipole: 0.55932 -0.68851 -0.12919 1.85148 -1.80143 0.05005 0.19517 -0.35109 -0.15592
magnitude: 0.20858 au
magnitude: 0.53017 debye
